{"text_format":"1","workbook":"xlsx","n_sheets":7,"sheets":["Project Details","Dashboard","Data","Main","Felicity Comparison","Maps","Site 1"],"not_rendered":{"charts":2,"images":12,"macros":1,"external_links":1,"defined_names":16,"comments":1,"pivot_tables":0},"unopened":[],"bounds":{"document_bytes":16777216,"sheet_cells":100000,"rows_first":2000,"rows_last":500,"rows_between":2000,"halvings":0,"cell_chars":16384,"cell_head_chars":4096},"cells_cut":0,"cells_raw":0,"read":"whole","date_system":"1900"}

{"sheet":"Project Details","index":0,"n_rows":26,"n_cols":18,"rows_kept":26,"cut":false,"hidden":false,"merged":[[13,5,13,6],[18,5,21,11]]}
[]
[]
[]
[]
[]
[]
[null,null,null,null,null,null,null,null,null,null,null,null,null,null,null,null,null,"Junction Turning Count"]
[]
[null,null,"Project Number",null,null,"4742-LON "]
[null,null,"Project Name",null,null,"Fisher’s Lane Repeat"]
[null,null,"Client",null,null,"Metis"]
[]
[null,null,"Site",null,null,"1. South Parade/ Fishers Lane"]
[null,null,"Survey Date",null,null,"20/10/2020"]
[null,null,"Survey Time",null,null,"07:00-19:00"]
[]
[null,null,"Weather",null,null,"Dry"]
[]
[null,null,"Observations",null,null,"No incidents or observations during the survey period."]
[]
[]
[]
[]
[]
[null,"Tracsis will retain all personal data relating to this project, including all video images, for a period of three months after receipt of this report and all other data files for one year. "]
[null,"If you would like a copy of the personal data or wish for us to retain for a longer period, please do not hesitate to contact us."]

{"sheet":"Dashboard","index":1,"n_rows":41,"n_cols":55,"rows_kept":41,"cut":false,"hidden":true,"merged":[[3,33,3,36],[7,1,7,9],[55,15,55,16],[55,18,55,30],[56,15,56,16],[71,15,71,20],[71,21,71,30],[56,23,57,23],[58,23,59,23],[60,23,61,23],[62,23,63,23],[64,23,65,23],[66,23,67,23],[68,23,69,23],[56,24,57,24],[58,24,59,24],[60,24,61,24],[62,24,63,24],[64,24,65,24],[67,15,69,16],[57,15,59,16],[8,26,14,31],[66,24,67,24],[68,24,69,24],[56,27,57,27],[58,27,59,27],[56,28,57,28],[58,28,59,28],[65,15,65,16],[66,15,66,16]]}
[null,null,null,null,null,null,null,null,null,null,null,null,null,null,null,null,null,null,null,null,null,null,null,null,null,null,null,null,null,null,null,null,null,null,null,null,null,0,null,null,null,null,null,null,null,null,null,null,null,null,null,null,null,1,1]
[null,null,null,null,null,null,null,null,null,null,null,null,null,null,null,null,null,null,null,null,null,null,null,null,null,null,null,null,null,null,null,null,null,null,null,null,{"$f":"'Project Details'!F9&\" \"&'Project Details'!F10","v":"4742-LON  Fisher’s Lane Repeat"},null,null,0]
[null,null,null,null,null,null,null,null,null,null,null,null,null,null,null,null,null,null,null,null,null,null,null,null,null,null,null,null,null,null,null,null,null,null,null,null,{"$f":"'Project Details'!R7","v":"Junction Turning Count"}]
[null,null,null,null,null,null,null,null,null,null,null,null,null,null,null,null,null,null,null,null,null,null,null,null,null,null,null,null,null,null,null,null,null,{"$f":"'Project Details'!F14","v":"20/10/2020"}]
[]
[]
[null,null,null,null,null,null,null,null,null,null,null,null,null,null,null,null,"Arm",null,null,null,null,"Location",null,null,null,null,"Observations"]
[]
[null,null,null,null,null,null,null,null,null,null,null,null,null,null,null,null,"A","A409 South Parade (E)",null,null,null,null,null,"51.49535"]
[null,null,null,null,null,null,null,null,null,null,null,null,null,null,null,null,"B","Fisher's Lane",null,null,null,null,null,"-0.26043"]
[null,null,null,null,null,null,null,null,null,null,null,null,null,null,null,null,"C","A409 South Parade (W)"]
[]
[]
[]
[]
[]
[]
[null,null,null,null,null,null,null,null,null,null,null,null,null,null,null,null,"Total Number of Vehicles per Interval"]
[]
[]
[]
[]
[]
[]
[]
[]
[]
[null,null,null,null,null,null,null,null,null,null,null,null,null,null,null,null,null,null,null,null,null,null,null,null,"O-D Movement Matrix",null,null,null,null,null,null,null,null,"Road Names"]
[]
[null,null,null,null,null,null,null,null,null,null,null,null,null,null,null,null,null,null,null,null,null,null,null,null,null,null,null,null,null,null,null,"G"]
[null,null,null,null,null,null,null,null,null,null,null,null,null,null,null,null,"Percentage of Classed Vehicles"]
[]
[null,null,null,null,null,null,null,null,null,null,null,null,null,null,null,null,null,null,null,null,null,null,null,null,null,null,null,null,"A","B","C"]
[null,null,null,null,null,"D","E","F","G",null,null,null,null,null,null,null,null,null,null,null,null,null,null,null,null,null,null,"A",9,259,3737]
[null,null,null,null,null,null,null,null,null,null,null,null,null,null,null,null,null,null,null,null,null,null,null,null,"E",null,null,"B",297,0,245]
[null,null,null,null,null,null,null,null,null,null,null,null,null,null,null,null,null,null,null,null,null,null,null,null,"F",null,null,"C",3519,324,17]
[null,null,null,null,null,null,null,null,null,null,null,null,null,null,null,null,null,null,null,null,null,null,null,null,"G"]
[null,"D"]
[null,"E"]
[null,"F"]
[null,"G"]

{"sheet":"Data","index":2,"n_rows":318,"n_cols":169,"rows_kept":318,"cut":false,"hidden":true,"merged":[]}
["site","x,y","lat,lon",null,null,null,null,null,null,null,null,null,null,"time periods",null,null,null,null,"Class","Colour",null,null,null,null,"Counts for overview Flow diagram, origin and destination ( sheet2)","Site 1",0,0,0,0,0,0,0,0,null,null,null,null,null,null,null,null,null,null,"07:00:00","07:00:00",1,1,1,null,1,1,null,1,1,"ALL","counts for arm flow diagram, arm X- arm Y","A_A","A_B","A_C","B_A","B_B","B_C","C_A","C_B","C_C"]
["Site 1","640.0,640.0","51.495349,-0.260427","A,78.231711068,A409 South Parade (E),452.57565750000003,286.102764375","B,181.27303002,Fisher's Lane,363.93424687500004,370.42020375","C,278.130102354,A409 South Parade (W),297.63335437499995,280.337469375",null,null,null,null,null,null,null,"07:00-19:00",null,null,null,null,null,null,null,"Towards is first column",null,null,null,"Site 2",0,0,0,0,0,0,0,0,0,0,null,null,null,null,null,null,null,null,"07:15:00","07:15:00",1,48,null,"Car",1,1,null,null,null,"A",null,9,259,3737,297,0,245,3519,324,17,0,0,0,0,0,0,0,0,0,0,0,0,0,0,0,0,0,0,0,0,0,0,0,0,0,0,0,0,0,0,0,0,0,0,0,0,0,0,0,0,0,0,0,0,0,0,0,0,0,0,0,0,0,0,0,0,0,0,0,0,0,0,0,0,0,0,0,0,0]
[null,null,null,null,null,null,null,null,null,null,null,null,null,"15",null,null,null,null,"CAR",null,null,"Away is second column ",null,null,null,null,null,null,null,null,null,null,null,null,null,null,null,null,null,null,null,null,null,null,"07:30:00","07:30:00",null,null,null,"LGV",1,1,null,null,null,"B"]
[null,null,null,null,null,null,null,null,null,null,null,null,null,"4742-LON ",null,null,null,null,null,null,null,"For each arm",null,null,null,null,null,null,null,null,null,null,null,null,null,null,null,null,null,null,null,null,null,null,"07:45:00","07:45:00",null,null,null,"OGV1",1,1.5,null,null,null,"C"]
[null,null,null,null,null,null,null,null,null,null,null,null,null,"Fisher’s Lane Repeat",null,null,null,null,"LGV",null,null,null,null,null,null,null,null,null,null,null,null,null,null,null,null,null,null,null,null,null,null,null,null,null,"08:00:00","08:00:00",null,null,null,"OGV2",1,2.2999999999999998]
[null,null,null,null,null,null,null,null,null,null,null,null,null,"20/10/2020",null,null,null,null,null,null,null,null,null,null,null,null,null,null,null,null,null,null,null,null,null,null,null,null,null,null,null,null,null,null,"08:15:00","08:15:00",null,null,null,"PSV",1,2]
[null,null,null,null,null,null,null,null,null,null,null,null,null,600,"<--overview map size",null,null,null,"OGV1",null,null,null,null,null,null,null,null,null,null,null,null,null,null,null,null,null,null,null,null,null,null,null,null,null,"08:30:00","08:30:00",null,null,null,"MC",1,0.4]
[null,null,null,null,null,null,null,null,null,null,null,null,null,true,null,null,null,null,null,null,null,null,null,null,null,null,null,null,null,null,null,null,null,null,null,null,null,null,null,null,null,null,null,null,"08:45:00","08:45:00",null,null,null,"PC",1,0.2]
[null,null,null,null,null,null,null,null,null,null,null,null,null,null,null,null,null,null,"OGV2",null,null,null,null,null,null,null,null,null,null,null,null,null,null,null,null,null,null,null,null,null,null,null,null,null,"09:00:00","09:00:00",null,null,null,null,1,2]
[null,null,null,null,null,null,null,null,null,null,null,null,null,null,null,null,null,null,null,null,null,null,null,null,null,null,null,null,null,null,null,null,null,null,null,null,null,null,null,null,null,null,null,null,"09:15:00","09:15:00",null,null,null,null,1]
[null,null,null,null,null,null,null,null,null,null,null,null,null,null,null,null,null,null,"PSV",null,null,null,null,null,null,null,null,null,null,null,null,null,null,null,null,null,null,null,null,null,null,null,null,null,"09:30:00","09:30:00",null,null,null,null,1]
[null,null,null,null,null,null,null,null,null,null,null,null,null,null,null,null,null,null,null,null,null,null,null,null,null,null,null,null,null,null,null,null,null,null,null,null,null,null,null,null,null,null,null,null,"09:45:00","09:45:00",null,null,null,null,1]
[null,null,null,null,null,null,null,null,null,null,null,null,null,null,null,null,null,null,"MCL",null,null,null,null,null,null,null,null,null,null,null,null,null,null,null,null,null,null,null,null,null,null,null,null,null,"10:00:00","10:00:00",null,null,null,null,1]
[null,null,null,null,null,null,null,null,null,null,null,null,null,null,null,null,null,null,null,null,null,null,null,null,null,null,null,null,null,null,null,null,null,null,null,null,null,null,null,null,null,null,null,null,"10:15:00","10:15:00",null,null,null,null,1]
[null,null,null,null,null,null,null,null,null,null,null,null,null,null,null,null,null,null,"PCL",null,null,null,null,null,null,null,null,null,null,null,null,null,null,null,null,null,null,null,null,null,null,null,null,null,"10:30:00","10:30:00",null,null,null,null,1]
[null,null,null,null,null,null,null,null,null,null,null,null,null,null,null,null,null,null,null,null,null,null,null,null,null,null,null,null,null,null,null,null,null,null,null,null,null,null,null,null,null,null,null,null,"10:45:00","10:45:00",null,null,null,null,1]
[null,null,null,null,null,null,null,null,null,null,null,null,null,null,null,null,null,null,"OGV",null,null,null,null,null,null,null,null,null,null,null,null,null,null,null,null,null,null,null,null,null,null,null,null,null,"11:00:00","11:00:00"]
[null,null,null,null,null,null,null,null,null,null,null,null,null,null,null,null,null,null,null,null,null,null,null,null,null,null,null,null,null,null,null,null,null,null,null,null,null,null,null,null,null,null,null,null,"11:15:00","11:15:00"]
[null,null,null,null,null,null,null,null,null,null,null,null,null,null,null,null,null,null,"MGV2",null,null,null,null,null,null,null,null,null,null,null,null,null,null,null,null,null,null,null,null,null,null,null,null,null,"11:30:00","11:30:00"]
[null,null,null,null,null,null,null,null,null,null,null,null,null,null,null,null,null,null,null,null,null,null,null,null,null,null,null,null,null,null,null,null,null,null,null,null,null,null,null,null,null,null,null,null,"11:45:00","11:45:00"]
[null,null,null,null,null,null,null,null,null,null,null,null,null,null,null,null,null,null,"PC",null,null,null,null,null,null,null,null,null,null,null,null,null,null,null,null,null,null,null,null,null,null,null,null,null,"12:00:00","12:00:00"]
[null,null,null,null,null,null,null,null,null,null,null,null,null,null,null,null,null,null,null,null,null,null,null,null,null,null,null,null,null,null,null,null,null,null,null,null,null,null,null,null,null,null,null,null,"12:15:00","12:15:00"]
[null,null,null,null,null,null,null,null,null,null,null,null,null,null,null,null,null,null,"BUS",null,null,null,null,null,null,null,null,null,null,null,null,null,null,null,null,null,null,null,null,null,null,null,null,null,"12:30:00","12:30:00"]
[null,null,null,null,null,null,null,null,null,null,null,null,null,null,null,null,null,null,null,null,null,null,null,null,null,null,null,null,null,null,null,null,null,null,null,null,null,null,null,null,null,null,null,null,"12:45:00","12:45:00"]
[null,null,null,null,null,null,null,null,null,null,null,null,null,null,null,null,null,null,"MC",null,null,null,null,null,null,null,null,null,null,null,null,null,null,null,null,null,null,null,null,null,null,null,null,null,"13:00:00","13:00:00"]
[null,null,null,null,null,null,null,null,null,null,null,null,null,null,null,null,null,null,null,null,null,null,null,null,null,null,null,null,null,null,null,null,null,null,null,null,null,null,null,null,null,null,null,null,"13:15:00","13:15:00"]
[null,null,null,null,null,null,null,null,null,null,null,null,null,null,null,null,null,null,"HGV",null,null,null,null,null,null,null,null,null,null,null,null,null,null,null,null,null,null,null,null,null,null,null,null,null,"13:30:00","13:30:00"]
[null,null,null,null,null,null,null,null,null,null,null,null,null,null,null,null,null,null,null,null,null,null,null,null,null,null,null,null,null,null,null,null,null,null,null,null,null,null,null,null,null,null,null,null,"13:45:00","13:45:00"]
[null,null,null,null,null,null,null,null,null,null,null,null,null,null,null,null,null,null,"MGV",null,null,null,null,null,null,null,null,null,null,null,null,null,null,null,null,null,null,null,null,null,null,null,null,null,"14:00:00","14:00:00"]
[null,null,null,null,null,null,null,null,null,null,null,null,null,null,null,null,null,null,null,null,null,null,null,null,null,null,null,null,null,null,null,null,null,null,null,null,null,null,null,null,null,null,null,null,"14:15:00","14:15:00"]
[null,null,null,null,null,null,null,null,null,null,null,null,null,null,null,null,null,null,"LTAX",null,null,null,null,null,null,null,null,null,null,null,null,null,null,null,null,null,null,null,null,null,null,null,null,null,"14:30:00","14:30:00"]
[null,null,null,null,null,null,null,null,null,null,null,null,null,null,null,null,null,null,null,null,null,null,null,null,null,null,null,null,null,null,null,null,null,null,null,null,null,null,null,null,null,null,null,null,"14:45:00","14:45:00"]
[null,null,null,null,null,null,null,null,null,null,null,null,null,null,null,null,null,null,"CVN",null,null,null,null,null,null,null,null,null,null,null,null,null,null,null,null,null,null,null,null,null,null,null,null,null,"15:00:00","15:00:00"]
[null,null,null,null,null,null,null,null,null,null,null,null,null,null,null,null,null,null,null,null,null,null,null,null,null,null,null,null,null,null,null,null,null,null,null,null,null,null,null,null,null,null,null,null,"15:15:00","15:15:00"]
[null,null,null,null,null,null,null,null,null,null,null,null,null,null,null,null,null,null,"AGR",null,null,null,null,null,null,null,null,null,null,null,null,null,null,null,null,null,null,null,null,null,null,null,null,null,"15:30:00","15:30:00"]
[null,null,null,null,null,null,null,null,null,null,null,null,null,null,null,null,null,null,null,null,null,null,null,null,null,null,null,null,null,null,null,null,null,null,null,null,null,null,null,null,null,null,null,null,"15:45:00","15:45:00"]
[null,null,null,null,null,null,null,null,null,null,null,null,null,null,null,null,null,null,"OTH",null,null,null,null,null,null,null,null,null,null,null,null,null,null,null,null,null,null,null,null,null,null,null,null,null,"16:00:00","16:00:00"]
[null,null,null,null,null,null,null,null,null,null,null,null,null,null,null,null,null,null,null,null,null,null,null,null,null,null,null,null,null,null,null,null,null,null,null,null,null,null,null,null,null,null,null,null,"16:15:00","16:15:00"]
[null,null,null,null,null,null,null,null,null,null,null,null,null,null,null,null,null,null,"PCLRed",null,null,null,null,null,null,null,null,null,null,null,null,null,null,null,null,null,null,null,null,null,null,null,null,null,"16:30:00","16:30:00"]
[null,null,null,null,null,null,null,null,null,null,null,null,null,null,null,null,null,null,null,null,null,null,null,null,null,null,null,null,null,null,null,null,null,null,null,null,null,null,null,null,null,null,null,null,"16:45:00","16:45:00"]
[null,null,null,null,null,null,null,null,null,null,null,null,null,null,null,null,null,null,"R3",null,null,null,null,null,null,null,null,null,null,null,null,null,null,null,null,null,null,null,null,null,null,null,null,null,"17:00:00","17:00:00"]
[null,null,null,null,null,null,null,null,null,null,null,null,null,null,null,null,null,null,null,null,null,null,null,null,null,null,null,null,null,null,null,null,null,null,null,null,null,null,null,null,null,null,null,null,"17:15:00","17:15:00"]
[null,null,null,null,null,null,null,null,null,null,null,null,null,null,null,null,null,null,"R4",null,null,null,null,null,null,null,null,null,null,null,null,null,null,null,null,null,null,null,null,null,null,null,null,null,"17:30:00","17:30:00"]
[null,null,null,null,null,null,null,null,null,null,null,null,null,null,null,null,null,null,null,null,null,null,null,null,null,null,null,null,null,null,null,null,null,null,null,null,null,null,null,null,null,null,null,null,"17:45:00","17:45:00"]
[null,null,null,null,null,null,null,null,null,null,null,null,null,null,null,null,null,null,"A5",null,null,null,null,null,null,null,null,null,null,null,null,null,null,null,null,null,null,null,null,null,null,null,null,null,"18:00:00","18:00:00"]
[null,null,null,null,null,null,null,null,null,null,null,null,null,null,null,null,null,null,null,null,null,null,null,null,null,null,null,null,null,null,null,null,null,null,null,null,null,null,null,null,null,null,null,null,"18:15:00","18:15:00"]
[null,null,null,null,null,null,null,null,null,null,null,null,null,null,null,null,null,null,"A6",null,null,null,null,null,null,null,null,null,null,null,null,null,null,null,null,null,null,null,null,null,null,null,null,null,"18:30:00","18:30:00"]
[null,null,null,null,null,null,null,null,null,null,null,null,null,null,null,null,null,null,null,null,null,null,null,null,null,null,null,null,null,null,null,null,null,null,null,null,null,null,null,null,null,null,null,null,"18:45:00","18:45:00"]
[null,null,null,null,null,null,null,null,null,null,null,null,null,null,null,null,null,null,"PED",null,null,null,null,null,null,null,null,null,null,null,null,null,null,null,null,null,null,null,null,null,null,null,null,null,"19:00:00","19:00:00"]
[]
[null,null,null,null,null,null,null,null,null,null,null,null,null,null,null,null,null,null,"WCH"]
[]
[null,null,null,null,null,null,null,null,null,null,null,null,null,null,null,null,null,null,"MOB"]
[]
[null,null,null,null,null,null,null,null,null,null,null,null,null,null,null,null,null,null,"EQU"]
[]
[null,null,null,null,null,null,null,null,null,null,null,null,null,null,null,null,null,null,"PWC"]
[]
[null,null,null,null,null,null,null,null,null,null,null,null,null,null,null,null,null,null,"PWD"]
[]
[null,null,null,null,null,null,null,null,null,null,null,null,null,null,null,null,null,null,"PUSH"]
[]
[null,null,null,null,null,null,null,null,null,null,null,null,null,null,null,null,null,null,"ALLPED"]
[]
[null,null,null,null,null,null,null,null,null,null,null,null,null,null,null,null,null,null,"PCLBlue"]
[]
[]
[]
[]
[]
[]
[]
[]
[]
[]
[]
[]
[]
[]
[null,null,null,null,null,null,null,null,null,null,null,null,null,null,null,null,null,null,null,null,null,null,null,null,null,"a","v","b","n","m","m,",",",",.",".","."]
[null,null,null,null,null,null,null,null,null,null,null,null,null,null,null,null,null,null,null,null,null,"07:00:00","07:15:00"]
[null,null,null,null,null,null,null,null,null,null,null,null,null,null,null,null,null,null,null,null,null,"07:15:00","07:30:00"]
[null,null,null,null,null,null,null,null,null,null,null,null,null,null,null,null,null,null,null,null,null,"07:30:00","07:45:00"]
[null,null,null,null,null,null,null,null,null,null,null,null,null,null,null,null,null,null,null,null,null,"07:45:00","08:00:00"]
[null,null,null,null,null,null,null,null,null,null,null,null,null,null,null,null,null,null,null,null,null,"08:00:00","08:15:00"]
[null,null,null,null,null,null,null,null,null,null,null,null,null,null,null,null,null,null,null,null,null,"08:15:00","08:30:00"]
[null,null,null,null,null,null,null,null,null,null,null,null,null,null,null,null,null,null,null,null,null,"08:30:00","08:45:00"]
[null,null,null,null,null,null,null,null,null,null,null,null,null,null,null,null,null,null,null,null,null,"08:45:00","09:00:00"]
[null,null,null,null,null,null,null,null,null,null,null,null,null,null,null,null,null,null,null,null,null,"09:00:00","09:15:00"]
[null,null,null,null,null,null,null,null,null,null,null,null,null,null,null,null,null,null,null,null,null,"09:15:00","09:30:00"]
[null,null,null,null,null,null,null,null,null,null,null,null,null,null,null,null,null,null,null,null,null,"09:30:00","09:45:00"]
[null,null,null,null,null,null,null,null,null,null,null,null,null,null,null,null,null,null,null,null,null,"09:45:00","10:00:00"]
[null,null,null,null,null,null,null,null,null,null,null,null,null,null,null,null,null,null,null,null,null,"10:00:00","10:15:00"]
[null,null,null,null,null,null,null,null,null,null,null,null,null,null,null,null,null,null,null,null,null,"10:15:00","10:30:00"]
[null,null,null,null,null,null,null,null,null,null,null,null,null,null,null,null,null,null,null,null,null,"10:30:00","10:45:00"]
[null,null,null,null,null,null,null,null,null,null,null,null,null,null,null,null,null,null,null,null,null,"10:45:00","11:00:00"]
[null,null,null,null,null,null,null,null,null,null,null,null,null,null,null,null,null,null,null,null,null,"11:00:00","11:15:00"]
[null,null,null,null,null,null,null,null,null,null,null,null,null,null,null,null,null,null,null,null,null,"11:15:00","11:30:00"]
[null,null,null,null,null,null,null,null,null,null,null,null,null,null,null,null,null,null,null,null,null,"11:30:00","11:45:00",null,null,null,"07:00:00","07:15:00","07:30:00","07:45:00","08:00:00","08:15:00","08:30:00","08:45:00","09:00:00","09:15:00","09:30:00","09:45:00","10:00:00","10:15:00","10:30:00","10:45:00","11:00:00","11:15:00","11:30:00","11:45:00","12:00:00","12:15:00","12:30:00","12:45:00","13:00:00","13:15:00","13:30:00","13:45:00","14:00:00","14:15:00","14:30:00","14:45:00","15:00:00","15:15:00","15:30:00","15:45:00","16:00:00","16:15:00","16:30:00","16:45:00","17:00:00","17:15:00","17:30:00","17:45:00","18:00:00","18:15:00","18:30:00","18:45:00"]
["ALL","Site 1,640.0,640.0,A,458.0,-13.999999970197678,B,210.0,228.0,C,26.0,-22.0",null,null,null,null,null,null,null,null,null,null,null,null,null,null,null,null,null,null,null,"11:45:00","12:00:00",null,"Counts for graph on dashboard, volume counts","Car",74,82,96,106,116,125,141,135,133,127,104,121,104,99,114,124,110,94,103,123,107,113,114,125,132,113,110,99,96,152,104,118,144,139,113,132,134,124,117,126,152,132,138,152,131,138,134,130]
[null,null,null,null,null,null,null,null,null,null,null,null,null,null,null,null,null,null,null,null,null,"12:00:00","12:15:00",null,null,"LGV",19,22,35,38,20,23,27,29,26,30,37,30,28,18,32,23,32,26,36,26,29,26,22,27,22,26,15,26,20,17,19,18,24,25,19,20,26,21,20,18,22,15,12,9,8,8,11,9]
[null,null,null,null,null,null,null,null,null,null,null,null,null,null,null,null,null,null,null,null,null,"12:15:00","12:30:00",null,null,"OGV1",0,1,2,5,3,1,5,4,7,2,1,2,1,4,3,3,0,0,1,4,4,1,5,1,3,3,4,2,2,2,1,3,3,4,2,1,2,6,0,2,0,2,1,1,1,0,1,0]
[null,null,null,null,null,null,null,null,null,null,null,null,null,null,null,null,null,null,null,null,null,"12:30:00","12:45:00",null,null,"OGV2",0,0,0,0,0,0,0,0,0,0,0,0,0,0,0,0,0,0,0,0,0,0,0,0,0,0,0,1,0,0,0,1,0,0,0,0,0,0,0,0,0,0,0,0,0,0,0,0]
[null,null,null,null,null,null,null,null,null,null,null,null,null,null,null,null,null,null,null,null,null,"12:45:00","13:00:00",null,null,"PSV",8,10,10,7,10,6,9,6,8,6,8,7,7,5,9,5,8,6,6,7,5,7,6,9,8,7,7,6,9,8,7,8,7,7,7,5,6,10,6,6,8,7,5,9,5,6,6,6]
[null,null,null,null,null,null,null,null,null,null,null,null,null,null,null,null,null,null,null,null,null,"13:00:00","13:15:00",null,null,"MC",0,4,7,5,5,7,4,9,5,5,7,5,5,6,3,6,11,10,10,14,4,9,11,6,10,18,9,10,14,14,19,11,16,10,8,10,7,6,10,15,7,16,15,8,12,10,18,30]
[null,null,null,null,null,null,null,null,null,null,null,null,null,null,null,null,null,null,null,null,null,"13:15:00","13:30:00",null,null,"PC",7,22,21,9,19,20,17,19,13,17,12,12,8,9,7,7,6,11,9,9,8,7,5,12,10,9,8,14,8,9,14,18,9,11,15,11,15,21,24,22,26,13,22,27,16,13,22,13]
[null,null,null,null,null,null,null,null,null,null,null,null,null,null,null,null,null,null,null,null,null,"13:30:00","13:45:00"]
[null,null,null,null,null,null,null,null,null,null,null,null,null,null,null,null,null,null,null,null,null,"13:45:00","14:00:00"]
[null,null,null,null,null,null,null,null,null,null,null,null,null,null,null,null,null,null,null,null,null,"14:00:00","14:15:00"]
[null,null,null,null,null,null,null,null,null,null,null,null,null,null,null,null,null,null,null,null,null,"14:15:00","14:30:00"]
[null,null,null,null,null,null,null,null,null,null,null,null,null,null,null,null,null,null,null,null,null,"14:30:00","14:45:00"]
[null,null,null,null,null,null,null,null,null,null,null,null,null,null,null,null,null,null,null,null,null,"14:45:00","15:00:00"]
[null,null,null,null,null,null,null,null,null,null,null,null,null,null,null,null,null,null,null,null,null,"15:00:00","15:15:00"]
[null,null,null,null,null,null,null,null,null,null,null,null,null,null,null,null,null,null,null,null,null,"15:15:00","15:30:00"]
[null,null,null,null,null,null,null,null,null,null,null,null,null,null,null,null,null,null,null,null,null,"15:30:00","15:45:00"]
[null,null,null,null,null,null,null,null,null,null,null,null,null,null,null,null,null,null,null,null,null,"15:45:00","16:00:00"]
[null,null,null,null,null,null,null,null,null,null,null,null,null,null,null,null,null,null,null,null,null,"16:00:00","16:15:00"]
[null,null,null,null,null,null,null,null,null,null,null,null,null,null,null,null,null,null,null,null,null,"16:15:00","16:30:00"]
[null,null,null,null,null,null,null,null,null,null,null,null,null,null,null,null,null,null,null,null,null,"16:30:00","16:45:00"]
[null,null,null,null,null,null,null,null,null,null,null,null,null,null,null,null,null,null,null,null,null,"16:45:00","17:00:00",null,"Counts for pie chart","Car",0.68395384798382297]
[null,null,null,null,null,null,null,null,null,null,null,null,null,null,null,null,null,null,null,null,null,"17:00:00","17:15:00",null,null,"LGV",0.12977280837397406]
[null,null,null,null,null,null,null,null,null,null,null,null,null,null,null,null,null,null,null,null,null,"17:15:00","17:30:00",null,null,"OGV1",1.260854050196265E-2]
[null,null,null,null,null,null,null,null,null,null,null,null,null,null,null,null,null,null,null,null,null,"17:30:00","17:45:00",null,null,"OGV2",2.3789699060306887E-4]
[null,null,null,null,null,null,null,null,null,null,null,null,null,null,null,null,null,null,null,null,null,"17:45:00","18:00:00",null,null,"PSV",4.0561436897823246E-2]
[null,null,null,null,null,null,null,null,null,null,null,null,null,null,null,null,null,null,null,null,null,"18:00:00","18:15:00",null,null,"MC",5.4835256334007376E-2]
[null,null,null,null,null,null,null,null,null,null,null,null,null,null,null,null,null,null,null,null,null,"18:15:00","18:30:00",null,null,"PC",7.8030212917806596E-2]
[null,null,null,null,null,null,null,null,null,null,null,null,null,null,null,null,null,null,null,null,null,"18:30:00","18:45:00"]
[null,null,null,null,null,null,null,null,null,null,null,null,null,null,null,null,null,null,null,null,null,"18:45:00","19:00:00"]
[]
[]
[]
[]
[]
[]
[]
[]
[]
[]
[]
[null,null,null,null,null,null,null,null,null,null,null,null,null,null,null,null,null,null,null,null,null,null,null,null,null,"07:00:00","07:15:00","07:30:00","07:45:00","08:00:00","08:15:00","08:30:00","08:45:00","09:00:00","09:15:00","09:30:00","09:45:00","10:00:00","10:15:00","10:30:00","10:45:00","11:00:00","11:15:00","11:30:00","11:45:00","12:00:00","12:15:00","12:30:00","12:45:00","13:00:00","13:15:00","13:30:00","13:45:00","14:00:00","14:15:00","14:30:00","14:45:00","15:00:00","15:15:00","15:30:00","15:45:00","16:00:00","16:15:00","16:30:00","16:45:00","17:00:00","17:15:00","17:30:00","17:45:00","18:00:00","18:15:00","18:30:00","18:45:00"]
[null,null,null,null,null,null,null,null,null,null,null,null,null,null,null,null,null,null,null,null,null,null,null,null,0,108,141,171,170,173,182,203,202,192,187,169,177,153,141,168,168,167,147,165,183,157,163,163,180,185,176,153,158,149,202,164,177,203,196,164,179,190,188,177,189,215,185,193,206,173,175,192,188,0,0,0,0,0,0,0,0,0,0,0,0,0,0,0,0,0,0,0,0,0,0,0,0,0,0,0,0,0,0,0,0,0,0,0,0,0,0,0,0,0,0,0,0,0,0,0,0,0,0,0,0,0,0,0,0,0,0,0,0,0,0,0,0,0,0,0,0,0,0,0,0,0,0,0,0,0,0,0,0,0,0,0,0,0,0,0,0,0,0,0,0,0,0,0,0]
[]
[]
[]
[]
[]
[]
[]
[]
[]
[]
[]
[]
[]
[]
[]
[]
[]
[]
[]
[]
[]
[]
[]
[]
[]
[]
[]
[]
[]
[]
[]
[]
[]
[]
[]
[null,null,null,null,null,null,null,null,null,null,null,null,null,null,null,null,null,null,null,null,null,null,null,null,null,null,null,null,null,null,null,null,null,null,null,null,null,null,null,null,null,null,null,null,{"$f":"AS176+\"00:15:00\"","v":1.0416666666666666E-2}]
[null,null,null,null,null,null,null,null,null,null,null,null,null,null,null,null,null,null,null,null,null,null,null,null,null,null,null,null,null,null,null,null,null,null,null,null,null,null,null,null,null,null,null,null,2.0833333333333332E-2]
[null,null,null,null,null,null,null,null,null,null,null,null,null,null,null,null,null,null,null,null,null,null,null,null,null,null,null,null,null,null,null,null,null,null,null,null,null,null,null,null,null,null,null,null,3.125E-2]
[null,null,null,null,null,null,null,null,null,null,null,null,null,null,null,null,null,null,null,null,null,null,null,null,null,null,null,null,null,null,null,null,null,null,null,null,null,null,null,null,null,null,null,null,4.1666666666666664E-2]
[null,null,null,null,null,null,null,null,null,null,null,null,null,null,null,null,null,null,null,null,null,null,null,null,null,null,null,null,null,null,null,null,null,null,null,null,null,null,null,null,null,null,null,null,5.2083333333333329E-2]
[null,null,null,null,null,null,null,null,null,null,null,null,null,null,null,null,null,null,null,null,null,null,null,null,null,null,null,null,null,null,null,null,null,null,null,null,null,null,null,null,null,null,null,null,6.2499999999999993E-2]
[null,null,null,null,null,null,null,null,null,null,null,null,null,null,null,null,null,null,null,null,null,null,null,null,null,null,null,null,null,null,null,null,null,null,null,null,null,null,null,null,null,null,null,null,7.2916666666666657E-2]
[null,null,null,null,null,null,null,null,null,null,null,null,null,null,null,null,null,null,null,null,null,null,null,null,null,null,null,null,null,null,null,null,null,null,null,null,null,null,null,null,null,null,null,null,8.3333333333333329E-2]
[null,null,null,null,null,null,null,null,null,null,null,null,null,null,null,null,null,null,null,null,null,null,null,null,null,null,null,null,null,null,null,null,null,null,null,null,null,null,null,null,null,null,null,null,9.375E-2]
[null,null,null,null,null,null,null,null,null,null,null,null,null,null,null,null,null,null,null,null,null,null,null,null,null,null,null,null,null,null,null,null,null,null,null,null,null,null,null,null,null,null,null,null,0.10416666666666667]
[null,null,null,null,null,null,null,null,null,null,null,null,null,null,null,null,null,null,null,null,null,null,null,null,null,null,null,null,null,null,null,null,null,null,null,null,null,null,null,null,null,null,null,null,0.11458333333333334]
[null,null,null,null,null,null,null,null,null,null,null,null,null,null,null,null,null,null,null,null,null,null,null,null,null,null,null,null,null,null,null,null,null,null,null,null,null,null,null,null,null,null,null,null,0.125]
[null,null,null,null,null,null,null,null,null,null,null,null,null,null,null,null,null,null,null,null,null,null,null,null,null,null,null,null,null,null,null,null,null,null,null,null,null,null,null,null,null,null,null,null,0.13541666666666666]
[null,null,null,null,null,null,null,null,null,null,null,null,null,null,null,null,null,null,null,null,null,null,null,null,null,null,null,null,null,null,null,null,null,null,null,null,null,null,null,null,null,null,null,null,0.14583333333333331]
[null,null,null,null,null,null,null,null,null,null,null,null,null,null,null,null,null,null,null,null,null,null,null,null,null,null,null,null,null,null,null,null,null,null,null,null,null,null,null,null,null,null,null,null,0.15624999999999997]
[null,null,null,null,null,null,null,null,null,null,null,null,null,null,null,null,null,null,null,null,null,null,null,null,null,null,null,null,null,null,null,null,null,null,null,null,null,null,null,null,null,null,null,null,0.16666666666666663]
[null,null,null,null,null,null,null,null,null,null,null,null,null,null,null,null,null,null,null,null,null,null,null,null,null,null,null,null,null,null,null,null,null,null,null,null,null,null,null,null,null,null,null,null,0.17708333333333329]
[null,null,null,null,null,null,null,null,null,null,null,null,null,null,null,null,null,null,null,null,null,null,null,null,null,null,null,null,null,null,null,null,null,null,null,null,null,null,null,null,null,null,null,null,0.18749999999999994]
[null,null,null,null,null,null,null,null,null,null,null,null,null,null,null,null,null,null,null,null,null,null,null,null,null,null,null,null,null,null,null,null,null,null,null,null,null,null,null,null,null,null,null,null,0.1979166666666666]
[null,null,null,null,null,null,null,null,null,null,null,null,null,null,null,null,null,null,null,null,null,null,null,null,null,null,null,null,null,null,null,null,null,null,null,null,null,null,null,null,null,null,null,null,0.20833333333333326]
[null,null,null,null,null,null,null,null,null,null,null,null,null,null,null,null,null,null,null,null,null,null,null,null,null,null,null,null,null,null,null,null,null,null,null,null,null,null,null,null,null,null,null,null,0.21874999999999992]
[null,null,null,null,null,null,null,null,null,null,null,null,null,null,null,null,null,null,null,null,null,null,null,null,null,null,null,null,null,null,null,null,null,null,null,null,null,null,null,null,null,null,null,null,0.22916666666666657]
[null,null,null,null,null,null,null,null,null,null,null,null,null,null,null,null,null,null,null,null,null,null,null,null,null,null,null,null,null,null,null,null,null,null,null,null,null,null,null,null,null,null,null,null,0.23958333333333323]
[null,null,null,null,null,null,null,null,null,null,null,null,null,null,null,null,null,null,null,null,null,null,null,null,null,null,null,null,null,null,null,null,null,null,null,null,null,null,null,null,null,null,null,null,0.24999999999999989]
[null,null,null,null,null,null,null,null,null,null,null,null,null,null,null,null,null,null,null,null,null,null,null,null,null,null,null,null,null,null,null,null,null,null,null,null,null,null,null,null,null,null,null,null,0.26041666666666657]
[null,null,null,null,null,null,null,null,null,null,null,null,null,null,null,null,null,null,null,null,null,null,null,null,null,null,null,null,null,null,null,null,null,null,null,null,null,null,null,null,null,null,null,null,0.27083333333333326]
[null,null,null,null,null,null,null,null,null,null,null,null,null,null,null,null,null,null,null,null,null,null,null,null,null,null,null,null,null,null,null,null,null,null,null,null,null,null,null,null,null,null,null,null,0.28124999999999994]
[null,null,null,null,null,null,null,null,null,null,null,null,null,null,null,null,null,null,null,null,null,null,null,null,null,null,null,null,null,null,null,null,null,null,null,null,null,null,null,null,null,null,null,null,"07:00:00"]
[null,null,null,null,null,null,null,null,null,null,null,null,null,null,null,null,null,null,null,null,null,null,null,null,null,null,null,null,null,null,null,null,null,null,null,null,null,null,null,null,null,null,null,null,"07:15:00"]
[null,null,null,null,null,null,null,null,null,null,null,null,null,null,null,null,null,null,null,null,null,null,null,null,null,null,null,null,null,null,null,null,null,null,null,null,null,null,null,null,null,null,null,null,"07:30:00"]
[null,null,null,null,null,null,null,null,null,null,null,null,null,null,null,null,null,null,null,null,null,null,null,null,null,null,null,null,null,null,null,null,null,null,null,null,null,null,null,null,null,null,null,null,"07:45:00"]
[null,null,null,null,null,null,null,null,null,null,null,null,null,null,null,null,null,null,null,null,null,null,null,null,null,null,null,null,null,null,null,null,null,null,null,null,null,null,null,null,null,null,null,null,"08:00:00"]
[null,null,null,null,null,null,null,null,null,null,null,null,null,null,null,null,null,null,null,null,null,null,null,null,null,null,null,null,null,null,null,null,null,null,null,null,null,null,null,null,null,null,null,null,{"$f":"AS208+\"00:15:00\"","v":"08:15:00"}]
[null,null,null,null,null,null,null,null,null,null,null,null,null,null,null,null,null,null,null,null,null,null,null,null,null,null,null,null,null,null,null,null,null,null,null,null,null,null,null,null,null,null,null,null,"08:30:00"]
[null,null,null,null,null,null,null,null,null,null,null,null,null,null,null,null,null,null,null,null,null,null,null,null,null,null,null,null,null,null,null,null,null,null,null,null,null,null,null,null,null,null,null,null,"08:45:00"]
[null,null,null,null,null,null,null,null,null,null,null,null,null,null,null,null,null,null,null,null,null,null,null,null,null,null,null,null,null,null,null,null,null,null,null,null,null,null,null,null,null,null,null,null,"09:00:00"]
[null,null,null,null,null,null,null,null,null,null,null,null,null,null,null,null,null,null,null,null,null,null,null,null,null,null,null,null,null,null,null,null,null,null,null,null,null,null,null,null,null,null,null,null,"09:15:00"]
[null,null,null,null,null,null,null,null,null,null,null,null,null,null,null,null,null,null,null,null,null,null,null,null,null,null,null,null,null,null,null,null,null,null,null,null,null,null,null,null,null,null,null,null,"09:30:00"]
[null,null,null,null,null,null,null,null,null,null,null,null,null,null,null,null,null,null,null,null,null,null,null,null,null,null,null,null,null,null,null,null,null,null,null,null,null,null,null,null,null,null,null,null,"09:45:00"]
[null,null,null,null,null,null,null,null,null,null,null,null,null,null,null,null,null,null,null,null,null,null,null,null,null,null,null,null,null,null,null,null,null,null,null,null,null,null,null,null,null,null,null,null,"10:00:00"]
[null,null,null,null,null,null,null,null,null,null,null,null,null,null,null,null,null,null,null,null,null,null,null,null,null,null,null,null,null,null,null,null,null,null,null,null,null,null,null,null,null,null,null,null,"10:15:00"]
[null,null,null,null,null,null,null,null,null,null,null,null,null,null,null,null,null,null,null,null,null,null,null,null,null,null,null,null,null,null,null,null,null,null,null,null,null,null,null,null,null,null,null,null,"10:30:00"]
[null,null,null,null,null,null,null,null,null,null,null,null,null,null,null,null,null,null,null,null,null,null,null,null,null,null,null,null,null,null,null,null,null,null,null,null,null,null,null,null,null,null,null,null,"10:45:00"]
[null,null,null,null,null,null,null,null,null,null,null,null,null,null,null,null,null,null,null,null,null,null,null,null,null,null,null,null,null,null,null,null,null,null,null,null,null,null,null,null,null,null,null,null,"11:00:00"]
[null,null,null,null,null,null,null,null,null,null,null,null,null,null,null,null,null,null,null,null,null,null,null,null,null,null,null,null,null,null,null,null,null,null,null,null,null,null,null,null,null,null,null,null,"11:15:00"]
[null,null,null,null,null,null,null,null,null,null,null,null,null,null,null,null,null,null,null,null,null,null,null,null,null,null,null,null,null,null,null,null,null,null,null,null,null,null,null,null,null,null,null,null,"11:30:00"]
[null,null,null,null,null,null,null,null,null,null,null,null,null,null,null,null,null,null,null,null,null,null,null,null,null,null,null,null,null,null,null,null,null,null,null,null,null,null,null,null,null,null,null,null,"11:45:00"]
[null,null,null,null,null,null,null,null,null,null,null,null,null,null,null,null,null,null,null,null,null,null,null,null,null,null,null,null,null,null,null,null,null,null,null,null,null,null,null,null,null,null,null,null,"12:00:00"]
[null,null,null,null,null,null,null,null,null,null,null,null,null,null,null,null,null,null,null,null,null,null,null,null,null,null,null,null,null,null,null,null,null,null,null,null,null,null,null,null,null,null,null,null,"12:15:00"]
[null,null,null,null,null,null,null,null,null,null,null,null,null,null,null,null,null,null,null,null,null,null,null,null,null,null,null,null,null,null,null,null,null,null,null,null,null,null,null,null,null,null,null,null,"12:30:00"]
[null,null,null,null,null,null,null,null,null,null,null,null,null,null,null,null,null,null,null,null,null,null,null,null,null,null,null,null,null,null,null,null,null,null,null,null,null,null,null,null,null,null,null,null,"12:45:00"]
[null,null,null,null,null,null,null,null,null,null,null,null,null,null,null,null,null,null,null,null,null,null,null,null,null,null,null,null,null,null,null,null,null,null,null,null,null,null,null,null,null,null,null,null,"13:00:00"]
[null,null,null,null,null,null,null,null,null,null,null,null,null,null,null,null,null,null,null,null,null,null,null,null,null,null,null,null,null,null,null,null,null,null,null,null,null,null,null,null,null,null,null,null,"13:15:00"]
[null,null,null,null,null,null,null,null,null,null,null,null,null,null,null,null,null,null,null,null,null,null,null,null,null,null,null,null,null,null,null,null,null,null,null,null,null,null,null,null,null,null,null,null,"13:30:00"]
[null,null,null,null,null,null,null,null,null,null,null,null,null,null,null,null,null,null,null,null,null,null,null,null,null,null,null,null,null,null,null,null,null,null,null,null,null,null,null,null,null,null,null,null,"13:45:00"]
[null,null,null,null,null,null,null,null,null,null,null,null,null,null,null,null,null,null,null,null,null,null,null,null,null,null,null,null,null,null,null,null,null,null,null,null,null,null,null,null,null,null,null,null,"14:00:00"]
[null,null,null,null,null,null,null,null,null,null,null,null,null,null,null,null,null,null,null,null,null,null,null,null,null,null,null,null,null,null,null,null,null,null,null,null,null,null,null,null,null,null,null,null,"14:15:00"]
[null,null,null,null,null,null,null,null,null,null,null,null,null,null,null,null,null,null,null,null,null,null,null,null,null,null,null,null,null,null,null,null,null,null,null,null,null,null,null,null,null,null,null,null,"14:30:00"]
[null,null,null,null,null,null,null,null,null,null,null,null,null,null,null,null,null,null,null,null,null,null,null,null,null,null,null,null,null,null,null,null,null,null,null,null,null,null,null,null,null,null,null,null,"14:45:00"]
[null,null,null,null,null,null,null,null,null,null,null,null,null,null,null,null,null,null,null,null,null,null,null,null,null,null,null,null,null,null,null,null,null,null,null,null,null,null,null,null,null,null,null,null,"15:00:00"]
[null,null,null,null,null,null,null,null,null,null,null,null,null,null,null,null,null,null,null,null,null,null,null,null,null,null,null,null,null,null,null,null,null,null,null,null,null,null,null,null,null,null,null,null,"15:15:00"]
[null,null,null,null,null,null,null,null,null,null,null,null,null,null,null,null,null,null,null,null,null,null,null,null,null,null,null,null,null,null,null,null,null,null,null,null,null,null,null,null,null,null,null,null,"15:30:00"]
[null,null,null,null,null,null,null,null,null,null,null,null,null,null,null,null,null,null,null,null,null,null,null,null,null,null,null,null,null,null,null,null,null,null,null,null,null,null,null,null,null,null,null,null,"15:45:00"]
[null,null,null,null,null,null,null,null,null,null,null,null,null,null,null,null,null,null,null,null,null,null,null,null,null,null,null,null,null,null,null,null,null,null,null,null,null,null,null,null,null,null,null,null,"16:00:00"]
[null,null,null,null,null,null,null,null,null,null,null,null,null,null,null,null,null,null,null,null,null,null,null,null,null,null,null,null,null,null,null,null,null,null,null,null,null,null,null,null,null,null,null,null,{"$f":"AS240+\"00:15:00\"","v":"16:15:00"}]
[null,null,null,null,null,null,null,null,null,null,null,null,null,null,null,null,null,null,null,null,null,null,null,null,null,null,null,null,null,null,null,null,null,null,null,null,null,null,null,null,null,null,null,null,"16:30:00"]
[null,null,null,null,null,null,null,null,null,null,null,null,null,null,null,null,null,null,null,null,null,null,null,null,null,null,null,null,null,null,null,null,null,null,null,null,null,null,null,null,null,null,null,null,"16:45:00"]
[null,null,null,null,null,null,null,null,null,null,null,null,null,null,null,null,null,null,null,null,null,null,null,null,null,null,null,null,null,null,null,null,null,null,null,null,null,null,null,null,null,null,null,null,"17:00:00"]
[null,null,null,null,null,null,null,null,null,null,null,null,null,null,null,null,null,null,null,null,null,null,null,null,null,null,null,null,null,null,null,null,null,null,null,null,null,null,null,null,null,null,null,null,"17:15:00"]
[null,null,null,null,null,null,null,null,null,null,null,null,null,null,null,null,null,null,null,null,null,null,null,null,null,null,null,null,null,null,null,null,null,null,null,null,null,null,null,null,null,null,null,null,"17:30:00"]
[null,null,null,null,null,null,null,null,null,null,null,null,null,null,null,null,null,null,null,null,null,null,null,null,null,null,null,null,null,null,null,null,null,null,null,null,null,null,null,null,null,null,null,null,"17:45:00"]
[null,null,null,null,null,null,null,null,null,null,null,null,null,null,null,null,null,null,null,null,null,null,null,null,null,null,null,null,null,null,null,null,null,null,null,null,null,null,null,null,null,null,null,null,"18:00:00"]
[null,null,null,null,null,null,null,null,null,null,null,null,null,null,null,null,null,null,null,null,null,null,null,null,null,null,null,null,null,null,null,null,null,null,null,null,null,null,null,null,null,null,null,null,"18:15:00"]
[null,null,null,null,null,null,null,null,null,null,null,null,null,null,null,null,null,null,null,null,null,null,null,null,null,null,null,null,null,null,null,null,null,null,null,null,null,null,null,null,null,null,null,null,"18:30:00"]
[null,null,null,null,null,null,null,null,null,null,null,null,null,null,null,null,null,null,null,null,null,null,null,null,null,null,null,null,null,null,null,null,null,null,null,null,null,null,null,null,null,null,null,null,"18:45:00"]
[null,null,null,null,null,null,null,null,null,null,null,null,null,null,null,null,null,null,null,null,null,null,null,null,null,null,null,null,null,null,null,null,null,null,null,null,null,null,null,null,null,null,null,null,"19:00:00"]
[null,null,null,null,null,null,null,null,null,null,null,null,null,null,null,null,null,null,null,null,null,null,null,null,null,null,null,null,null,null,null,null,null,null,null,null,null,null,null,null,null,null,null,null,"19:15:00"]
[null,null,null,null,null,null,null,null,null,null,null,null,null,null,null,null,null,null,null,null,null,null,null,null,null,null,null,null,null,null,null,null,null,null,null,null,null,null,null,null,null,null,null,null,"19:30:00"]
[null,null,null,null,null,null,null,null,null,null,null,null,null,null,null,null,null,null,null,null,null,null,null,null,null,null,null,null,null,null,null,null,null,null,null,null,null,null,null,null,null,null,null,null,"19:45:00"]
[null,null,null,null,null,null,null,null,null,null,null,null,null,null,null,null,null,null,null,null,null,null,null,null,null,null,null,null,null,null,null,null,null,null,null,null,null,null,null,null,null,null,null,null,"20:00:00"]
[null,null,null,null,null,null,null,null,null,null,null,null,null,null,null,null,null,null,null,null,null,null,null,null,null,null,null,null,null,null,null,null,null,null,null,null,null,null,null,null,null,null,null,null,"20:15:00"]
[null,null,null,null,null,null,null,null,null,null,null,null,null,null,null,null,null,null,null,null,null,null,null,null,null,null,null,null,null,null,null,null,null,null,null,null,null,null,null,null,null,null,null,null,"20:30:00"]
[null,null,null,null,null,null,null,null,null,null,null,null,null,null,null,null,null,null,null,null,null,null,null,null,null,null,null,null,null,null,null,null,null,null,null,null,null,null,null,null,null,null,null,null,"20:45:00"]
[null,null,null,null,null,null,null,null,null,null,null,null,null,null,null,null,null,null,null,null,null,null,null,null,null,null,null,null,null,null,null,null,null,null,null,null,null,null,null,null,null,null,null,null,"21:00:00"]
[null,null,null,null,null,null,null,null,null,null,null,null,null,null,null,null,null,null,null,null,null,null,null,null,null,null,null,null,null,null,null,null,null,null,null,null,null,null,null,null,null,null,null,null,"21:15:00"]
[null,null,null,null,null,null,null,null,null,null,null,null,null,null,null,null,null,null,null,null,null,null,null,null,null,null,null,null,null,null,null,null,null,null,null,null,null,null,null,null,null,null,null,null,"21:30:00"]
[null,null,null,null,null,null,null,null,null,null,null,null,null,null,null,null,null,null,null,null,null,null,null,null,null,null,null,null,null,null,null,null,null,null,null,null,null,null,null,null,null,null,null,null,"21:45:00"]
[null,null,null,null,null,null,null,null,null,null,null,null,null,null,null,null,null,null,null,null,null,null,null,null,null,null,null,null,null,null,null,null,null,null,null,null,null,null,null,null,null,null,null,null,"22:00:00"]
[null,null,null,null,null,null,null,null,null,null,null,null,null,null,null,null,null,null,null,null,null,null,null,null,null,null,null,null,null,null,null,null,null,null,null,null,null,null,null,null,null,null,null,null,"22:15:00"]
[null,null,null,null,null,null,null,null,null,null,null,null,null,null,null,null,null,null,null,null,null,null,null,null,null,null,null,null,null,null,null,null,null,null,null,null,null,null,null,null,null,null,null,null,"22:30:00"]
[null,null,null,null,null,null,null,null,null,null,null,null,null,null,null,null,null,null,null,null,null,null,null,null,null,null,null,null,null,null,null,null,null,null,null,null,null,null,null,null,null,null,null,null,"22:45:00"]
[null,null,null,null,null,null,null,null,null,null,null,null,null,null,null,null,null,null,null,null,null,null,null,null,null,null,null,null,null,null,null,null,null,null,null,null,null,null,null,null,null,null,null,null,"23:00:00"]
[null,null,null,null,null,null,null,null,null,null,null,null,null,null,null,null,null,null,null,null,null,null,null,null,null,null,null,null,null,null,null,null,null,null,null,null,null,null,null,null,null,null,null,null,"23:15:00"]
[null,null,null,null,null,null,null,null,null,null,null,null,null,null,null,null,null,null,null,null,null,null,null,null,null,null,null,null,null,null,null,null,null,null,null,null,null,null,null,null,null,null,null,null,"23:30:00"]
[null,null,null,null,null,null,null,null,null,null,null,null,null,null,null,null,null,null,null,null,null,null,null,null,null,null,null,null,null,null,null,null,null,null,null,null,null,null,null,null,null,null,null,null,"23:45:00"]
[null,null,null,null,null,null,null,null,null,null,null,null,null,null,null,null,null,null,null,null,null,null,null,null,null,null,null,null,null,null,null,null,null,null,null,null,null,null,null,null,null,null,null,null,0.99999999999999856]
[null,null,null,null,null,null,null,null,null,null,null,null,null,null,null,null,null,null,null,null,null,null,null,null,null,null,null,null,null,null,null,null,null,null,null,null,null,null,null,null,null,null,null,null,{"$f":"AS272+\"00:15:00\"","v":1.0104166666666652}]
[null,null,null,null,null,null,null,null,null,null,null,null,null,null,null,null,null,null,null,null,null,null,null,null,null,null,null,null,null,null,null,null,null,null,null,null,null,null,null,null,null,null,null,null,1.0208333333333319]
[null,null,null,null,null,null,null,null,null,null,null,null,null,null,null,null,null,null,null,null,null,null,null,null,null,null,null,null,null,null,null,null,null,null,null,null,null,null,null,null,null,null,null,null,1.0312499999999987]
[null,null,null,null,null,null,null,null,null,null,null,null,null,null,null,null,null,null,null,null,null,null,null,null,null,null,null,null,null,null,null,null,null,null,null,null,null,null,null,null,null,null,null,null,1.0416666666666654]
[null,null,null,null,null,null,null,null,null,null,null,null,null,null,null,null,null,null,null,null,null,null,null,null,null,null,null,null,null,null,null,null,null,null,null,null,null,null,null,null,null,null,null,null,1.0520833333333321]
[null,null,null,null,null,null,null,null,null,null,null,null,null,null,null,null,null,null,null,null,null,null,null,null,null,null,null,null,null,null,null,null,null,null,null,null,null,null,null,null,null,null,null,null,1.0624999999999989]
[null,null,null,null,null,null,null,null,null,null,null,null,null,null,null,null,null,null,null,null,null,null,null,null,null,null,null,null,null,null,null,null,null,null,null,null,null,null,null,null,null,null,null,null,1.0729166666666656]
[null,null,null,null,null,null,null,null,null,null,null,null,null,null,null,null,null,null,null,null,null,null,null,null,null,null,null,null,null,null,null,null,null,null,null,null,null,null,null,null,null,null,null,null,1.0833333333333324]
[null,null,null,null,null,null,null,null,null,null,null,null,null,null,null,null,null,null,null,null,null,null,null,null,null,null,null,null,null,null,null,null,null,null,null,null,null,null,null,null,null,null,null,null,1.0937499999999991]
[null,null,null,null,null,null,null,null,null,null,null,null,null,null,null,null,null,null,null,null,null,null,null,null,null,null,null,null,null,null,null,null,null,null,null,null,null,null,null,null,null,null,null,null,1.1041666666666659]
[null,null,null,null,null,null,null,null,null,null,null,null,null,null,null,null,null,null,null,null,null,null,null,null,null,null,null,null,null,null,null,null,null,null,null,null,null,null,null,null,null,null,null,null,1.1145833333333326]
[null,null,null,null,null,null,null,null,null,null,null,null,null,null,null,null,null,null,null,null,null,null,null,null,null,null,null,null,null,null,null,null,null,null,null,null,null,null,null,null,null,null,null,null,1.1249999999999993]
[null,null,null,null,null,null,null,null,null,null,null,null,null,null,null,null,null,null,null,null,null,null,null,null,null,null,null,null,null,null,null,null,null,null,null,null,null,null,null,null,null,null,null,null,1.1354166666666661]
[null,null,null,null,null,null,null,null,null,null,null,null,null,null,null,null,null,null,null,null,null,null,null,null,null,null,null,null,null,null,null,null,null,null,null,null,null,null,null,null,null,null,null,null,1.1458333333333328]
[null,null,null,null,null,null,null,null,null,null,null,null,null,null,null,null,null,null,null,null,null,null,null,null,null,null,null,null,null,null,null,null,null,null,null,null,null,null,null,null,null,null,null,null,1.1562499999999996]
[null,null,null,null,null,null,null,null,null,null,null,null,null,null,null,null,null,null,null,null,null,null,null,null,null,null,null,null,null,null,null,null,null,null,null,null,null,null,null,null,null,null,null,null,1.1666666666666663]
[null,null,null,null,null,null,null,null,null,null,null,null,null,null,null,null,null,null,null,null,null,null,null,null,null,null,null,null,null,null,null,null,null,null,null,null,null,null,null,null,null,null,null,null,1.177083333333333]
[null,null,null,null,null,null,null,null,null,null,null,null,null,null,null,null,null,null,null,null,null,null,null,null,null,null,null,null,null,null,null,null,null,null,null,null,null,null,null,null,null,null,null,null,1.1874999999999998]
[null,null,null,null,null,null,null,null,null,null,null,null,null,null,null,null,null,null,null,null,null,null,null,null,null,null,null,null,null,null,null,null,null,null,null,null,null,null,null,null,null,null,null,null,1.1979166666666665]
[null,null,null,null,null,null,null,null,null,null,null,null,null,null,null,null,null,null,null,null,null,null,null,null,null,null,null,null,null,null,null,null,null,null,null,null,null,null,null,null,null,null,null,null,1.2083333333333333]
[null,null,null,null,null,null,null,null,null,null,null,null,null,null,null,null,null,null,null,null,null,null,null,null,null,null,null,null,null,null,null,null,null,null,null,null,null,null,null,null,null,null,null,null,1.21875]
[null,null,null,null,null,null,null,null,null,null,null,null,null,null,null,null,null,null,null,null,null,null,null,null,null,null,null,null,null,null,null,null,null,null,null,null,null,null,null,null,null,null,null,null,1.2291666666666667]
[null,null,null,null,null,null,null,null,null,null,null,null,null,null,null,null,null,null,null,null,null,null,null,null,null,null,null,null,null,null,null,null,null,null,null,null,null,null,null,null,null,null,null,null,1.2395833333333335]
[null,null,null,null,null,null,null,null,null,null,null,null,null,null,null,null,null,null,null,null,null,null,null,null,null,null,null,null,null,null,null,null,null,null,null,null,null,null,null,null,null,null,null,null,1.2500000000000002]
[null,null,null,null,null,null,null,null,null,null,null,null,null,null,null,null,null,null,null,null,null,null,null,null,null,null,null,null,null,null,null,null,null,null,null,null,null,null,null,null,null,null,null,null,1.260416666666667]
[null,null,null,null,null,null,null,null,null,null,null,null,null,null,null,null,null,null,null,null,null,null,null,null,null,null,null,null,null,null,null,null,null,null,null,null,null,null,null,null,null,null,null,null,1.2708333333333337]
[null,null,null,null,null,null,null,null,null,null,null,null,null,null,null,null,null,null,null,null,null,null,null,null,null,null,null,null,null,null,null,null,null,null,null,null,null,null,null,null,null,null,null,null,1.2812500000000004]
[null,null,null,null,null,null,null,null,null,null,null,null,null,null,null,null,null,null,null,null,null,null,null,null,null,null,null,null,null,null,null,null,null,null,null,null,null,null,null,null,null,null,null,null,1.2916666666666672]
[null,null,null,null,null,null,null,null,null,null,null,null,null,null,null,null,null,null,null,null,null,null,null,null,null,null,null,null,null,null,null,null,null,null,null,null,null,null,null,null,null,null,null,null,1.3020833333333339]
[null,null,null,null,null,null,null,null,null,null,null,null,null,null,null,null,null,null,null,null,null,null,null,null,null,null,null,null,null,null,null,null,null,null,null,null,null,null,null,null,null,null,null,null,1.3125000000000007]
[null,null,null,null,null,null,null,null,null,null,null,null,null,null,null,null,null,null,null,null,null,null,null,null,null,null,null,null,null,null,null,null,null,null,null,null,null,null,null,null,null,null,null,null,1.3229166666666674]
[null,null,null,null,null,null,null,null,null,null,null,null,null,null,null,null,null,null,null,null,null,null,null,null,null,null,null,null,null,null,null,null,null,null,null,null,null,null,null,null,null,null,null,null,1.3333333333333341]
[null,null,null,null,null,null,null,null,null,null,null,null,null,null,null,null,null,null,null,null,null,null,null,null,null,null,null,null,null,null,null,null,null,null,null,null,null,null,null,null,null,null,null,null,{"$f":"AS304+\"00:15:00\"","v":1.3437500000000009}]
[null,null,null,null,null,null,null,null,null,null,null,null,null,null,null,null,null,null,null,null,null,null,null,null,null,null,null,null,null,null,null,null,null,null,null,null,null,null,null,null,null,null,null,null,1.3541666666666676]
[null,null,null,null,null,null,null,null,null,null,null,null,null,null,null,null,null,null,null,null,null,null,null,null,null,null,null,null,null,null,null,null,null,null,null,null,null,null,null,null,null,null,null,null,1.3645833333333344]
[null,null,null,null,null,null,null,null,null,null,null,null,null,null,null,null,null,null,null,null,null,null,null,null,null,null,null,null,null,null,null,null,null,null,null,null,null,null,null,null,null,null,null,null,1.3750000000000011]
[null,null,null,null,null,null,null,null,null,null,null,null,null,null,null,null,null,null,null,null,null,null,null,null,null,null,null,null,null,null,null,null,null,null,null,null,null,null,null,null,null,null,null,null,1.3854166666666679]
[null,null,null,null,null,null,null,null,null,null,null,null,null,null,null,null,null,null,null,null,null,null,null,null,null,null,null,null,null,null,null,null,null,null,null,null,null,null,null,null,null,null,null,null,1.3958333333333346]
[null,null,null,null,null,null,null,null,null,null,null,null,null,null,null,null,null,null,null,null,null,null,null,null,null,null,null,null,null,null,null,null,null,null,null,null,null,null,null,null,null,null,null,null,1.4062500000000013]
[null,null,null,null,null,null,null,null,null,null,null,null,null,null,null,null,null,null,null,null,null,null,null,null,null,null,null,null,null,null,null,null,null,null,null,null,null,null,null,null,null,null,null,null,1.4166666666666681]
[null,null,null,null,null,null,null,null,null,null,null,null,null,null,null,null,null,null,null,null,null,null,null,null,null,null,null,null,null,null,null,null,null,null,null,null,null,null,null,null,null,null,null,null,1.4270833333333348]
[null,null,null,null,null,null,null,null,null,null,null,null,null,null,null,null,null,null,null,null,null,null,null,null,null,null,null,null,null,null,null,null,null,null,null,null,null,null,null,null,null,null,null,null,1.4375000000000016]
[null,null,null,null,null,null,null,null,null,null,null,null,null,null,null,null,null,null,null,null,null,null,null,null,null,null,null,null,null,null,null,null,null,null,null,null,null,null,null,null,null,null,null,null,1.4479166666666683]
[null,null,null,null,null,null,null,null,null,null,null,null,null,null,null,null,null,null,null,null,null,null,null,null,null,null,null,null,null,null,null,null,null,null,null,null,null,null,null,null,null,null,null,null,1.458333333333335]
[null,null,null,null,null,null,null,null,null,null,null,null,null,null,null,null,null,null,null,null,null,null,null,null,null,null,null,null,null,null,null,null,null,null,null,null,null,null,null,null,null,null,null,null,1.4687500000000018]
[null,null,null,null,null,null,null,null,null,null,null,null,null,null,null,null,null,null,null,null,null,null,null,null,null,null,null,null,null,null,null,null,null,null,null,null,null,null,null,null,null,null,null,null,1.4791666666666685]

{"sheet":"Main","index":3,"n_rows":10,"n_cols":13,"rows_kept":10,"cut":false,"hidden":true,"merged":[]}
["Required Classes","Vivacity Classes",null,"Interval"]
["Car","CAR",null,15,null,null,null,null,null,null,null,null,"1 Click the 'Transfer…' button on the 'Main' worksheet."]
["LGV","LGV",null,null,null,null,null,null,null,null,null,null,"2 Select the folder containing the Vivacity CSV files you want to transfer to the template."]
["OGV1","OGV1",null,null,null,null,null,null,null,null,null,null,"3 For each site drag the relevant CSV across to the site list."]
["OGV2","OGV2",null,null,null,null,null,null,null,null,null,null,"4 Click the 'Transfer...' button on the form."]
["PSV","BUS"]
["MC","MC"]
["PC","PC"]
[]
[null,null,null,null,null,null,null,null,null,null,null,null,"Click the 'Populate…' button on the Main worksheet to populate the Felicity Comparison sheet with site/arm details from current template"]

{"sheet":"Felicity Comparison","index":4,"n_rows":53,"n_cols":23,"rows_kept":53,"cut":false,"hidden":true,"merged":[[0,0,1,0],[0,1,1,1],[0,2,1,2],[0,3,1,3],[0,4,1,4],[0,10,1,10],[0,11,1,11],[0,13,1,13],[0,5,1,5],[0,6,1,6],[0,7,1,7],[0,8,1,8],[0,9,1,9]]}
["Survey","Date","Site","Camera","Movement","Origin Arm","Destination Arm","Additional counts required?","Comment","Hours Passed","Hours Failed","Minutes Failed (5 minute multiples)",null,"Total Hours"]
[null,null,null,null,null,null,null,null,null,null,null,null,null,null,null,"Survey Start","07:00:00",null,1]
["3786-SCO","29/05/2019",1,1,"A-A","A","A",null,null,{"$f":"N3-M3","v":"00:00:00"},6,0,{"$f":"TIME(K3,L3,0)","v":"06:00:00"},{"$f":"$Q$4","v":"06:00:00"},null,"Survey End","19:00:00",null,"Origin Arm","Total hours","Passed hours","Failed hours"]
[null,null,null,null,null,null,null,null,null,null,null,null,null,null,null,"Survey Duration","06:00:00",null,"A",{"$f":"SUMIFS($N:$N,$F:$F,S4,$C:$C,S2)","v":0.25},{"$f":"SUMIFS($J:$J,$F:$F,S4,$C:$C,S2)","v":0},{"$f":"SUMIFS($M:$M,$F:$F,S4,$C:$C,S2)","v":0.25},{"$f":"IF(U4+V4=T4,\"OK\",\"Check\")","v":"OK"}]
[null,null,null,null,null,null,null,null,null,null,null,null,null,null,null,null,null,null,"B",{"$f":"SUMIFS($N:$N,$F:$F,S5,$C:$C,S2)","v":0},{"$f":"SUMIFS($J:$J,$F:$F,S5,$C:$C,S2)","v":0},{"$f":"SUMIFS($M:$M,$F:$F,S5,$C:$C,S2)","v":0},{"$f":"IF(U5+V5=T5,\"OK\",\"Check\")","v":"OK"}]
[null,null,null,null,null,null,null,null,null,null,null,null,null,null,null,null,null,null,"C",{"$f":"SUMIFS($N:$N,$F:$F,S6,$C:$C,S2)","v":0},{"$f":"SUMIFS($J:$J,$F:$F,S6,$C:$C,S2)","v":0},{"$f":"SUMIFS($M:$M,$F:$F,S6,$C:$C,S2)","v":0},{"$f":"IF(U6+V6=T6,\"OK\",\"Check\")","v":"OK"}]
[null,null,null,null,null,null,null,null,null,null,null,null,null,null,null,"Total",{"$f":"SUM(N:N)","v":0.25},null,"D",{"$f":"SUMIFS($N:$N,$F:$F,S7,$C:$C,S2)","v":0},{"$f":"SUMIFS($J:$J,$F:$F,S7,$C:$C,S2)","v":0},{"$f":"SUMIFS($M:$M,$F:$F,S7,$C:$C,S2)","v":0},{"$f":"IF(U7+V7=T7,\"OK\",\"Check\")","v":"OK"}]
[null,null,null,null,null,null,null,null,null,null,null,null,null,null,null,"Passed",{"$f":"SUM(J:J)","v":0}]
[null,null,null,null,null,null,null,null,null,null,null,null,null,null,null,"Failed",{"$f":"SUM(M:M)","v":0.25},null,2]
[null,null,null,null,null,null,null,null,null,null,null,null,null,null,null,"Pass Rate",{"$f":"Q8/Q7","v":0},null,"Origin Arm","Total hours","Passed hours","Failed hours"]
[null,null,null,null,null,null,null,null,null,null,null,null,null,null,null,null,null,null,"A",{"$f":"SUMIFS($N:$N,$F:$F,S11,$C:$C,S9)","v":0},{"$f":"SUMIFS($J:$J,$F:$F,S11,$C:$C,S9)","v":0},{"$f":"SUMIFS($M:$M,$F:$F,S11,$C:$C,S9)","v":0},{"$f":"IF(U11+V11=T11,\"OK\",\"Check\")","v":"OK"}]
[null,null,null,null,null,null,null,null,null,null,null,null,null,null,null,null,null,null,"B",{"$f":"SUMIFS($N:$N,$F:$F,S12,$C:$C,S9)","v":0},{"$f":"SUMIFS($J:$J,$F:$F,S12,$C:$C,S9)","v":0},{"$f":"SUMIFS($M:$M,$F:$F,S12,$C:$C,S9)","v":0},{"$f":"IF(U12+V12=T12,\"OK\",\"Check\")","v":"OK"}]
[null,null,null,null,null,null,null,null,null,null,null,null,null,null,null,"Site","Pass Rate",null,"C",{"$f":"SUMIFS($N:$N,$F:$F,S13,$C:$C,S9)","v":0},{"$f":"SUMIFS($J:$J,$F:$F,S13,$C:$C,S9)","v":0},{"$f":"SUMIFS($M:$M,$F:$F,S13,$C:$C,S9)","v":0},{"$f":"IF(U13+V13=T13,\"OK\",\"Check\")","v":"OK"}]
[null,null,null,null,null,null,null,null,null,null,null,null,null,null,null,1,null,null,"D",{"$f":"SUMIFS($N:$N,$F:$F,S14,$C:$C,S9)","v":0},{"$f":"SUMIFS($J:$J,$F:$F,S14,$C:$C,S9)","v":0},{"$f":"SUMIFS($M:$M,$F:$F,S14,$C:$C,S9)","v":0},{"$f":"IF(U14+V14=T14,\"OK\",\"Check\")","v":"OK"}]
[null,null,null,null,null,null,null,null,null,null,null,null,null,null,null,2]
[null,null,null,null,null,null,null,null,null,null,null,null,null,null,null,3,null,null,3]
[null,null,null,null,null,null,null,null,null,null,null,null,null,null,null,4,null,null,"Origin Arm","Total hours","Passed hours","Failed hours"]
[null,null,null,null,null,null,null,null,null,null,null,null,null,null,null,5,null,null,"A",{"$f":"SUMIFS($N:$N,$F:$F,S18,$C:$C,S16)","v":0},{"$f":"SUMIFS($J:$J,$F:$F,S18,$C:$C,S16)","v":0},{"$f":"SUMIFS($M:$M,$F:$F,S18,$C:$C,S16)","v":0},{"$f":"IF(U18+V18=T18,\"OK\",\"Check\")","v":"OK"}]
[null,null,null,null,null,null,null,null,null,null,null,null,null,null,null,6,null,null,"B",{"$f":"SUMIFS($N:$N,$F:$F,S19,$C:$C,S16)","v":0},{"$f":"SUMIFS($J:$J,$F:$F,S19,$C:$C,S16)","v":0},{"$f":"SUMIFS($M:$M,$F:$F,S19,$C:$C,S16)","v":0},{"$f":"IF(U19+V19=T19,\"OK\",\"Check\")","v":"OK"}]
[null,null,null,null,null,null,null,null,null,null,null,null,null,null,null,7,null,null,"C",{"$f":"SUMIFS($N:$N,$F:$F,S20,$C:$C,S16)","v":0},{"$f":"SUMIFS($J:$J,$F:$F,S20,$C:$C,S16)","v":0},{"$f":"SUMIFS($M:$M,$F:$F,S20,$C:$C,S16)","v":0},{"$f":"IF(U20+V20=T20,\"OK\",\"Check\")","v":"OK"}]
[null,null,null,null,null,null,null,null,null,null,null,null,null,null,null,8,null,null,"D",{"$f":"SUMIFS($N:$N,$F:$F,S21,$C:$C,S16)","v":0},{"$f":"SUMIFS($J:$J,$F:$F,S21,$C:$C,S16)","v":0},{"$f":"SUMIFS($M:$M,$F:$F,S21,$C:$C,S16)","v":0},{"$f":"IF(U21+V21=T21,\"OK\",\"Check\")","v":"OK"}]
[]
[null,null,null,null,null,null,null,null,null,null,null,null,null,null,null,null,null,null,4]
[null,null,null,null,null,null,null,null,null,null,null,null,null,null,null,null,null,null,"Origin Arm","Total hours","Passed hours","Failed hours"]
[null,null,null,null,null,null,null,null,null,null,null,null,null,null,null,null,null,null,"A",{"$f":"SUMIFS($N:$N,$F:$F,S25,$C:$C,S23)","v":0},{"$f":"SUMIFS($J:$J,$F:$F,S25,$C:$C,S23)","v":0},{"$f":"SUMIFS($M:$M,$F:$F,S25,$C:$C,S23)","v":0},{"$f":"IF(U25+V25=T25,\"OK\",\"Check\")","v":"OK"}]
[null,null,null,null,null,null,null,null,null,null,null,null,null,null,null,null,null,null,"B",{"$f":"SUMIFS($N:$N,$F:$F,S26,$C:$C,S23)","v":0},{"$f":"SUMIFS($J:$J,$F:$F,S26,$C:$C,S23)","v":0},{"$f":"SUMIFS($M:$M,$F:$F,S26,$C:$C,S23)","v":0},{"$f":"IF(U26+V26=T26,\"OK\",\"Check\")","v":"OK"}]
[null,null,null,null,null,null,null,null,null,null,null,null,null,null,null,null,null,null,"C",{"$f":"SUMIFS($N:$N,$F:$F,S27,$C:$C,S23)","v":0},{"$f":"SUMIFS($J:$J,$F:$F,S27,$C:$C,S23)","v":0},{"$f":"SUMIFS($M:$M,$F:$F,S27,$C:$C,S23)","v":0},{"$f":"IF(U27+V27=T27,\"OK\",\"Check\")","v":"OK"}]
[null,null,null,null,null,null,null,null,null,null,null,null,null,null,null,null,null,null,"D",{"$f":"SUMIFS($N:$N,$F:$F,S28,$C:$C,S23)","v":0},{"$f":"SUMIFS($J:$J,$F:$F,S28,$C:$C,S23)","v":0},{"$f":"SUMIFS($M:$M,$F:$F,S28,$C:$C,S23)","v":0},{"$f":"IF(U28+V28=T28,\"OK\",\"Check\")","v":"OK"}]
[]
[null,null,null,null,null,null,null,null,null,null,null,null,null,null,null,null,null,null,5]
[null,null,null,null,null,null,null,null,null,null,null,null,null,null,null,null,null,null,"Origin Arm","Total hours","Passed hours","Failed hours"]
[null,null,null,null,null,null,null,null,null,null,null,null,null,null,null,null,null,null,"A",{"$f":"SUMIFS($N:$N,$F:$F,S32,$C:$C,S30)","v":0},{"$f":"SUMIFS($J:$J,$F:$F,S32,$C:$C,S30)","v":0},{"$f":"SUMIFS($M:$M,$F:$F,S32,$C:$C,S30)","v":0},{"$f":"IF(U32+V32=T32,\"OK\",\"Check\")","v":"OK"}]
[null,null,null,null,null,null,null,null,null,null,null,null,null,null,null,null,null,null,"B",{"$f":"SUMIFS($N:$N,$F:$F,S33,$C:$C,S30)","v":0},{"$f":"SUMIFS($J:$J,$F:$F,S33,$C:$C,S30)","v":0},{"$f":"SUMIFS($M:$M,$F:$F,S33,$C:$C,S30)","v":0},{"$f":"IF(U33+V33=T33,\"OK\",\"Check\")","v":"OK"}]
[null,null,null,null,null,null,null,null,null,null,null,null,null,null,null,null,null,null,"C",{"$f":"SUMIFS($N:$N,$F:$F,S34,$C:$C,S30)","v":0},{"$f":"SUMIFS($J:$J,$F:$F,S34,$C:$C,S30)","v":0},{"$f":"SUMIFS($M:$M,$F:$F,S34,$C:$C,S30)","v":0},{"$f":"IF(U34+V34=T34,\"OK\",\"Check\")","v":"OK"}]
[]
[null,null,null,null,null,null,null,null,null,null,null,null,null,null,null,null,null,null,6]
[null,null,null,null,null,null,null,null,null,null,null,null,null,null,null,null,null,null,"Origin Arm","Total hours","Passed hours","Failed hours"]
[null,null,null,null,null,null,null,null,null,null,null,null,null,null,null,null,null,null,"A",{"$f":"SUMIFS($N:$N,$F:$F,S38,$C:$C,S36)","v":0},{"$f":"SUMIFS($J:$J,$F:$F,S38,$C:$C,S36)","v":0},{"$f":"SUMIFS($M:$M,$F:$F,S38,$C:$C,S36)","v":0},{"$f":"IF(U38+V38=T38,\"OK\",\"Check\")","v":"OK"}]
[null,null,null,null,null,null,null,null,null,null,null,null,null,null,null,null,null,null,"B",{"$f":"SUMIFS($N:$N,$F:$F,S39,$C:$C,S36)","v":0},{"$f":"SUMIFS($J:$J,$F:$F,S39,$C:$C,S36)","v":0},{"$f":"SUMIFS($M:$M,$F:$F,S39,$C:$C,S36)","v":0},{"$f":"IF(U39+V39=T39,\"OK\",\"Check\")","v":"OK"}]
[null,null,null,null,null,null,null,null,null,null,null,null,null,null,null,null,null,null,"C",{"$f":"SUMIFS($N:$N,$F:$F,S40,$C:$C,S36)","v":0},{"$f":"SUMIFS($J:$J,$F:$F,S40,$C:$C,S36)","v":0},{"$f":"SUMIFS($M:$M,$F:$F,S40,$C:$C,S36)","v":0},{"$f":"IF(U40+V40=T40,\"OK\",\"Check\")","v":"OK"}]
[]
[null,null,null,null,null,null,null,null,null,null,null,null,null,null,null,null,null,null,7]
[null,null,null,null,null,null,null,null,null,null,null,null,null,null,null,null,null,null,"Origin Arm","Total hours","Passed hours","Failed hours"]
[null,null,null,null,null,null,null,null,null,null,null,null,null,null,null,null,null,null,"A",{"$f":"SUMIFS($N:$N,$F:$F,S44,$C:$C,S42)","v":0},{"$f":"SUMIFS($J:$J,$F:$F,S44,$C:$C,S42)","v":0},{"$f":"SUMIFS($M:$M,$F:$F,S44,$C:$C,S42)","v":0},{"$f":"IF(U44+V44=T44,\"OK\",\"Check\")","v":"OK"}]
[null,null,null,null,null,null,null,null,null,null,null,null,null,null,null,null,null,null,"B",{"$f":"SUMIFS($N:$N,$F:$F,S45,$C:$C,S42)","v":0},{"$f":"SUMIFS($J:$J,$F:$F,S45,$C:$C,S42)","v":0},{"$f":"SUMIFS($M:$M,$F:$F,S45,$C:$C,S42)","v":0},{"$f":"IF(U45+V45=T45,\"OK\",\"Check\")","v":"OK"}]
[null,null,null,null,null,null,null,null,null,null,null,null,null,null,null,null,null,null,"C",{"$f":"SUMIFS($N:$N,$F:$F,S46,$C:$C,S42)","v":0},{"$f":"SUMIFS($J:$J,$F:$F,S46,$C:$C,S42)","v":0},{"$f":"SUMIFS($M:$M,$F:$F,S46,$C:$C,S42)","v":0},{"$f":"IF(U46+V46=T46,\"OK\",\"Check\")","v":"OK"}]
[]
[null,null,null,null,null,null,null,null,null,null,null,null,null,null,null,null,null,null,8]
[null,null,null,null,null,null,null,null,null,null,null,null,null,null,null,null,null,null,"Origin Arm","Total hours","Passed hours","Failed hours"]
[null,null,null,null,null,null,null,null,null,null,null,null,null,null,null,null,null,null,"A",{"$f":"SUMIFS($N:$N,$F:$F,S50,$C:$C,S48)","v":0},{"$f":"SUMIFS($J:$J,$F:$F,S50,$C:$C,S48)","v":0},{"$f":"SUMIFS($M:$M,$F:$F,S50,$C:$C,S48)","v":0},{"$f":"IF(U50+V50=T50,\"OK\",\"Check\")","v":"OK"}]
[null,null,null,null,null,null,null,null,null,null,null,null,null,null,null,null,null,null,"B",{"$f":"SUMIFS($N:$N,$F:$F,S51,$C:$C,S48)","v":0},{"$f":"SUMIFS($J:$J,$F:$F,S51,$C:$C,S48)","v":0},{"$f":"SUMIFS($M:$M,$F:$F,S51,$C:$C,S48)","v":0},{"$f":"IF(U51+V51=T51,\"OK\",\"Check\")","v":"OK"}]
[null,null,null,null,null,null,null,null,null,null,null,null,null,null,null,null,null,null,"C",{"$f":"SUMIFS($N:$N,$F:$F,S52,$C:$C,S48)","v":0},{"$f":"SUMIFS($J:$J,$F:$F,S52,$C:$C,S48)","v":0},{"$f":"SUMIFS($M:$M,$F:$F,S52,$C:$C,S48)","v":0},{"$f":"IF(U52+V52=T52,\"OK\",\"Check\")","v":"OK"}]
[null,null,null,null,null,null,null,null,null,null,null,null,null,null,null,null,null,null,"D",{"$f":"SUMIFS($N:$N,$F:$F,S53,$C:$C,S48)","v":0},{"$f":"SUMIFS($J:$J,$F:$F,S53,$C:$C,S48)","v":0},{"$f":"SUMIFS($M:$M,$F:$F,S53,$C:$C,S48)","v":0},{"$f":"IF(U53+V53=T53,\"OK\",\"Check\")","v":"OK"}]

{"sheet":"Maps","index":5,"n_rows":2,"n_cols":39,"rows_kept":2,"cut":false,"hidden":true,"merged":[]}
[]
["Site 1",null,null,null,null,"ALL",null,null,null,null,null,null,"No relevant observations",null,null,null,null,null,null,null,null,null,null,null,null,null,null,null,null,null,null,null,null,null,null,null,null,null,25]

{"sheet":"Site 1","index":6,"n_rows":341,"n_cols":29,"rows_kept":341,"cut":false,"hidden":false,"merged":[[2,25,2,28],[8,8,9,8],[75,8,76,8],[142,8,143,8],[209,8,210,8],[8,26,9,26],[75,26,76,26],[142,26,143,26],[209,26,210,26],[276,8,277,8],[8,17,9,17],[75,17,76,17],[142,17,143,17],[209,17,210,17],[276,17,277,17],[276,26,277,26],[8,28,9,28],[75,28,76,28],[142,28,143,28],[209,28,210,28],[276,28,277,28]]}
[null,null,null,null,null,null,null,null,null,null,null,null,null,null,null,null,null,null,null,null,null,null,null,null,null,null,null,null,{"$f":"'Project Details'!F9&\" \"&'Project Details'!F10","v":"4742-LON  Fisher’s Lane Repeat"}]
[null,null,null,null,null,null,null,null,null,null,null,null,null,null,null,null,null,null,null,null,null,null,null,null,null,null,null,null,{"$f":"'Project Details'!R7","v":"Junction Turning Count"}]
[null,null,null,null,null,null,null,null,null,null,null,null,null,null,null,null,null,null,null,null,null,null,null,null,null,{"$f":"'Project Details'!F14","v":"20/10/2020"}]
[]
[null,null,null,null,null,null,null,null,null,null,null,null,null,null,null,null,null,null,null,null,null,null,null,null,null,null,null,null,"Site 1 -  A409 South Parade (E) /  Fisher's Lane /  A409 South Parade (W)"]
[]
[]
["Origin :","Arm A","A409 South Parade (E)"]
[null,"Destination :",null,"Arm A","A409 South Parade (E)",null,null,null,"Total",null,"Destination :",null,"Arm B","Fisher's Lane",null,null,null,"Total",null,"Destination :",null,"Arm C","A409 South Parade (W)",null,null,null,"Total",null,"Arm Totals"]
[null,"Car","LGV","OGV1","OGV2","PSV","MC","PC",null,null,{"$f":"$B$10","v":"Car"},{"$f":"$C$10","v":"LGV"},{"$f":"$D$10","v":"OGV1"},{"$f":"$E$10","v":"OGV2"},{"$f":"$F$10","v":"PSV"},{"$f":"$G$10","v":"MC"},{"$f":"$H$10","v":"PC"},null,null,{"$f":"$B$10","v":"Car"},{"$f":"$C$10","v":"LGV"},{"$f":"$D$10","v":"OGV1"},{"$f":"$E$10","v":"OGV2"},{"$f":"$F$10","v":"PSV"},{"$f":"$G$10","v":"MC"},{"$f":"$H$10","v":"PC"}]
[]
["07:00:00",0,0,0,0,0,0,0,{"$f":"SUM(B12:H12)","v":0},null,0,0,0,0,0,0,2,{"$f":"SUM(K12:Q12)","v":2},null,26,5,0,0,4,0,2,{"$f":"SUM(T12:Z12)","v":37},null,{"$f":"SUM(I12+R12+AA12)","v":39}]
["07:15:00",0,0,0,0,0,0,0,{"$f":"SUM(B13:H13)","v":0},null,1,1,0,0,2,0,3.0000000000000004,{"$f":"SUM(K13:Q13)","v":7},null,38,5,0,0,3,0,4,{"$f":"SUM(T13:Z13)","v":50},null,{"$f":"SUM(I13+R13+AA13)","v":57}]
["07:30:00",0,0,0,0,0,0,0,{"$f":"SUM(B14:H14)","v":0},null,0,0,0,0,1,0,3.0000000000000004,{"$f":"SUM(K14:Q14)","v":4},null,33,5,0,0,5,0,3.0000000000000004,{"$f":"SUM(T14:Z14)","v":46},null,{"$f":"SUM(I14+R14+AA14)","v":50}]
["07:45:00",0,0,0,0,0,0,0,{"$f":"SUM(B15:H15)","v":0},null,3,1,0,0,0,0,0,{"$f":"SUM(K15:Q15)","v":4},null,33,11,1,0,3,2,1,{"$f":"SUM(T15:Z15)","v":51},null,{"$f":"SUM(I15+R15+AA15)","v":55}]
["1 Hr",{"$f":"SUM(B12:B15)","v":0},0,0,0,0,0,0,0,null,{"$f":"SUM(K12:K15)","v":4},2,0,0,3,0,8,17,null,{"$f":"SUM(T12:T15)","v":130},26,1,0,15,2,10,184,null,{"$f":"SUM(AC12:AC15)","v":201}]
["08:00:00",0,0,0,0,0,0,0,{"$f":"SUM(B17:H17)","v":0},null,3,0,0,0,2,0,1,{"$f":"SUM(K17:Q17)","v":6},null,41,6,1,0,3,0,0,{"$f":"SUM(T17:Z17)","v":51},null,{"$f":"SUM(I17+R17+AA17)","v":57}]
["08:15:00",0,0,0,0,0,0,0,{"$f":"SUM(B18:H18)","v":0},null,4,0,0,0,1,0,3.0000000000000004,{"$f":"SUM(K18:Q18)","v":8},null,48,7,0,0,2,0,0,{"$f":"SUM(T18:Z18)","v":57},null,{"$f":"SUM(I18+R18+AA18)","v":65}]
["08:30:00",0,0,0,0,0,0,0,{"$f":"SUM(B19:H19)","v":0},null,1,0,0,0,1,0,0,{"$f":"SUM(K19:Q19)","v":2},null,53,13,2,0,4,2,2,{"$f":"SUM(T19:Z19)","v":76},null,{"$f":"SUM(I19+R19+AA19)","v":78}]
["08:45:00",0,0,0,0,0,0,0,{"$f":"SUM(B20:H20)","v":0},null,1,0,0,0,1,0,2,{"$f":"SUM(K20:Q20)","v":4},null,64,12,0,0,2,4,4,{"$f":"SUM(T20:Z20)","v":86},null,{"$f":"SUM(I20+R20+AA20)","v":90}]
["1 Hr",{"$f":"SUM(B17:B20)","v":0},0,0,0,0,0,0,0,null,{"$f":"SUM(K17:K20)","v":9},0,0,0,5,0,6,20,null,{"$f":"SUM(T17:T20)","v":206},38,3,0,11,6,6,270,null,{"$f":"SUM(AC17:AC20)","v":290}]
["09:00:00",0,0,0,0,0,0,0,{"$f":"SUM(B22:H22)","v":0},null,3,1,0,0,1,0,1,{"$f":"SUM(K22:Q22)","v":6},null,62,11,2,0,3,3.0000000000000004,4,{"$f":"SUM(T22:Z22)","v":85},null,{"$f":"SUM(I22+R22+AA22)","v":91}]
["09:15:00",0,0,0,0,0,0,0,{"$f":"SUM(B23:H23)","v":0},null,1,2,0,0,1,0,2,{"$f":"SUM(K23:Q23)","v":6},null,59,13,1,0,2,4,1,{"$f":"SUM(T23:Z23)","v":80},null,{"$f":"SUM(I23+R23+AA23)","v":86}]
["09:30:00",0,0,0,0,0,0,0,{"$f":"SUM(B24:H24)","v":0},null,0,1,0,0,1,0,0,{"$f":"SUM(K24:Q24)","v":2},null,46,9,0,0,3,2,3.0000000000000004,{"$f":"SUM(T24:Z24)","v":63},null,{"$f":"SUM(I24+R24+AA24)","v":65}]
["09:45:00",0,0,0,0,0,0,0,{"$f":"SUM(B25:H25)","v":0},null,1,0,0,0,1,0,2,{"$f":"SUM(K25:Q25)","v":4},null,54,7,1,0,3,3.0000000000000004,1,{"$f":"SUM(T25:Z25)","v":69},null,{"$f":"SUM(I25+R25+AA25)","v":73}]
["1 Hr",{"$f":"SUM(B22:B25)","v":0},0,0,0,0,0,0,0,null,{"$f":"SUM(K22:K25)","v":5},4,0,0,4,0,5,18,null,{"$f":"SUM(T22:T25)","v":221},40,4,0,11,12,9,297,null,{"$f":"SUM(AC22:AC25)","v":315}]
["10:00:00",0,0,0,0,0,0,0,{"$f":"SUM(B27:H27)","v":0},null,3,0,0,0,1,0,2,{"$f":"SUM(K27:Q27)","v":6},null,32,6,1,0,3,2,1,{"$f":"SUM(T27:Z27)","v":45},null,{"$f":"SUM(I27+R27+AA27)","v":51}]
["10:15:00",1,0,0,0,0,0,0,{"$f":"SUM(B28:H28)","v":1},null,0,1,0,0,0,0,2,{"$f":"SUM(K28:Q28)","v":3},null,48,7,1,0,1,2,0,{"$f":"SUM(T28:Z28)","v":59},null,{"$f":"SUM(I28+R28+AA28)","v":63}]
["10:30:00",0,0,0,0,0,0,0,{"$f":"SUM(B29:H29)","v":0},null,4,1,0,0,2,0,0,{"$f":"SUM(K29:Q29)","v":7},null,56,12,2,0,3,1,0,{"$f":"SUM(T29:Z29)","v":74},null,{"$f":"SUM(I29+R29+AA29)","v":81}]
["10:45:00",0,0,0,0,0,0,0,{"$f":"SUM(B30:H30)","v":0},null,1,1,0,0,0,0,2,{"$f":"SUM(K30:Q30)","v":4},null,55,14,1,0,2,2,1,{"$f":"SUM(T30:Z30)","v":75},null,{"$f":"SUM(I30+R30+AA30)","v":79}]
["1 Hr",{"$f":"SUM(B27:B30)","v":1},0,0,0,0,0,0,1,null,{"$f":"SUM(K27:K30)","v":8},3,0,0,3,0,6,20,null,{"$f":"SUM(T27:T30)","v":191},39,5,0,9,7,2,253,null,{"$f":"SUM(AC27:AC30)","v":274}]
["11:00:00",0,0,0,0,0,0,0,{"$f":"SUM(B32:H32)","v":0},null,0,2,0,0,1,0,2,{"$f":"SUM(K32:Q32)","v":5},null,43,16,0,0,3,7,0,{"$f":"SUM(T32:Z32)","v":69},null,{"$f":"SUM(I32+R32+AA32)","v":74}]
["11:15:00",0,0,0,0,0,0,0,{"$f":"SUM(B33:H33)","v":0},null,1,0,0,0,1,0,0,{"$f":"SUM(K33:Q33)","v":2},null,37,10,0,0,2,2,0,{"$f":"SUM(T33:Z33)","v":51},null,{"$f":"SUM(I33+R33+AA33)","v":53}]
["11:30:00",1,0,0,0,0,0,0,{"$f":"SUM(B34:H34)","v":1},null,3,1,0,0,1,0,2,{"$f":"SUM(K34:Q34)","v":7},null,42,11,1,0,3,5,1,{"$f":"SUM(T34:Z34)","v":63},null,{"$f":"SUM(I34+R34+AA34)","v":71}]
["11:45:00",0,0,0,0,0,0,0,{"$f":"SUM(B35:H35)","v":0},null,0,0,0,0,1,0,1,{"$f":"SUM(K35:Q35)","v":2},null,60,15,1,0,3,6.0000000000000009,1,{"$f":"SUM(T35:Z35)","v":86},null,{"$f":"SUM(I35+R35+AA35)","v":88}]
["1 Hr",{"$f":"SUM(B32:B35)","v":1},0,0,0,0,0,0,1,null,{"$f":"SUM(K32:K35)","v":4},3,0,0,4,0,5,16,null,{"$f":"SUM(T32:T35)","v":182},52,2,0,11,20,2,269,null,{"$f":"SUM(AC32:AC35)","v":286}]
["12:00:00",0,0,0,0,0,0,0,{"$f":"SUM(B37:H37)","v":0},null,0,0,0,0,0,0,1,{"$f":"SUM(K37:Q37)","v":1},null,53,11,2,0,1,1,0,{"$f":"SUM(T37:Z37)","v":68},null,{"$f":"SUM(I37+R37+AA37)","v":69}]
["12:15:00",0,0,0,0,0,0,0,{"$f":"SUM(B38:H38)","v":0},null,2,0,0,0,2,1,0,{"$f":"SUM(K38:Q38)","v":5},null,53,14,0,0,2,5,0,{"$f":"SUM(T38:Z38)","v":74},null,{"$f":"SUM(I38+R38+AA38)","v":79}]
["12:30:00",0,0,0,0,0,0,0,{"$f":"SUM(B39:H39)","v":0},null,0,1,0,0,0,0,2,{"$f":"SUM(K39:Q39)","v":3},null,55,13,3,0,3,4,1,{"$f":"SUM(T39:Z39)","v":79},null,{"$f":"SUM(I39+R39+AA39)","v":82}]
["12:45:00",0,0,0,0,0,1,0,{"$f":"SUM(B40:H40)","v":1},null,1,3,0,0,1,0,1,{"$f":"SUM(K40:Q40)","v":6},null,60,12,1,0,4,0,3.0000000000000004,{"$f":"SUM(T40:Z40)","v":80},null,{"$f":"SUM(I40+R40+AA40)","v":87}]
["1 Hr",{"$f":"SUM(B37:B40)","v":0},0,0,0,0,1,0,1,null,{"$f":"SUM(K37:K40)","v":3},4,0,0,3,1,4,15,null,{"$f":"SUM(T37:T40)","v":221},50,6,0,10,10,4,301,null,{"$f":"SUM(AC37:AC40)","v":317}]
["13:00:00",0,0,0,0,0,0,0,{"$f":"SUM(B42:H42)","v":0},null,5,1,0,0,1,0,0,{"$f":"SUM(K42:Q42)","v":7},null,60,9,2,0,3,7,0,{"$f":"SUM(T42:Z42)","v":81},null,{"$f":"SUM(I42+R42+AA42)","v":88}]
["13:15:00",1,1,0,0,0,0,0,{"$f":"SUM(B43:H43)","v":2},null,1,0,0,0,1,0,1,{"$f":"SUM(K43:Q43)","v":3},null,57,16,2,0,3,6.0000000000000009,2,{"$f":"SUM(T43:Z43)","v":86},null,{"$f":"SUM(I43+R43+AA43)","v":91}]
["13:30:00",0,0,0,0,0,0,0,{"$f":"SUM(B44:H44)","v":0},null,2,0,0,0,1,0,2,{"$f":"SUM(K44:Q44)","v":5},null,59,10,3,0,2,5,3.0000000000000004,{"$f":"SUM(T44:Z44)","v":82},null,{"$f":"SUM(I44+R44+AA44)","v":87}]
["13:45:00",0,0,0,0,0,0,0,{"$f":"SUM(B45:H45)","v":0},null,4,2,0,0,1,1,2,{"$f":"SUM(K45:Q45)","v":10},null,50,13,2,1,2,5,2,{"$f":"SUM(T45:Z45)","v":75},null,{"$f":"SUM(I45+R45+AA45)","v":85}]
["1 Hr",{"$f":"SUM(B42:B45)","v":1},1,0,0,0,0,0,2,null,{"$f":"SUM(K42:K45)","v":12},3,0,0,4,1,5,25,null,{"$f":"SUM(T42:T45)","v":226},48,9,1,10,23,7,324,null,{"$f":"SUM(AC42:AC45)","v":351}]
["14:00:00",0,0,0,0,0,0,0,{"$f":"SUM(B47:H47)","v":0},null,0,0,0,0,1,0,1,{"$f":"SUM(K47:Q47)","v":2},null,51,13,0,0,4,10,1,{"$f":"SUM(T47:Z47)","v":79},null,{"$f":"SUM(I47+R47+AA47)","v":81}]
["14:15:00",0,0,0,0,0,0,0,{"$f":"SUM(B48:H48)","v":0},null,2,1,0,0,0,0,2,{"$f":"SUM(K48:Q48)","v":5},null,82,8,1,0,5,4,2,{"$f":"SUM(T48:Z48)","v":102},null,{"$f":"SUM(I48+R48+AA48)","v":107}]
["14:30:00",0,0,0,0,0,0,0,{"$f":"SUM(B49:H49)","v":0},null,3,1,0,0,1,0,1,{"$f":"SUM(K49:Q49)","v":6},null,49,13,0,0,1,8,0,{"$f":"SUM(T49:Z49)","v":71},null,{"$f":"SUM(I49+R49+AA49)","v":77}]
["14:45:00",0,0,0,0,0,0,0,{"$f":"SUM(B50:H50)","v":0},null,0,0,0,0,1,0,0,{"$f":"SUM(K50:Q50)","v":1},null,61,9,1,1,3,6.0000000000000009,1,{"$f":"SUM(T50:Z50)","v":82},null,{"$f":"SUM(I50+R50+AA50)","v":83}]
["1 Hr",{"$f":"SUM(B47:B50)","v":0},0,0,0,0,0,0,0,null,{"$f":"SUM(K47:K50)","v":5},2,0,0,3,0,4,14,null,{"$f":"SUM(T47:T50)","v":243},43,2,1,13,28,4,334,null,{"$f":"SUM(AC47:AC50)","v":348}]
["15:00:00",0,0,0,0,0,0,0,{"$f":"SUM(B52:H52)","v":0},null,3,0,0,0,1,1,0,{"$f":"SUM(K52:Q52)","v":5},null,66,19,3,0,3,7,1,{"$f":"SUM(T52:Z52)","v":99},null,{"$f":"SUM(I52+R52+AA52)","v":104}]
["15:15:00",0,0,0,0,0,0,0,{"$f":"SUM(B53:H53)","v":0},null,1,1,0,0,1,0,1,{"$f":"SUM(K53:Q53)","v":4},null,76,16,2,0,2,4,1,{"$f":"SUM(T53:Z53)","v":101},null,{"$f":"SUM(I53+R53+AA53)","v":105}]
["15:30:00",0,0,0,0,0,0,0,{"$f":"SUM(B54:H54)","v":0},null,2,0,0,0,1,0,3.0000000000000004,{"$f":"SUM(K54:Q54)","v":6},null,55,12,2,0,2,4,5,{"$f":"SUM(T54:Z54)","v":80},null,{"$f":"SUM(I54+R54+AA54)","v":86}]
["15:45:00",1,0,0,0,0,0,0,{"$f":"SUM(B55:H55)","v":1},null,3,0,0,0,0,2,0,{"$f":"SUM(K55:Q55)","v":5},null,77,15,1,0,2,6.0000000000000009,2,{"$f":"SUM(T55:Z55)","v":103},null,{"$f":"SUM(I55+R55+AA55)","v":109}]
["1 Hr",{"$f":"SUM(B52:B55)","v":1},0,0,0,0,0,0,1,null,{"$f":"SUM(K52:K55)","v":9},1,0,0,3,3,4,20,null,{"$f":"SUM(T52:T55)","v":274},62,8,0,9,21,9,383,null,{"$f":"SUM(AC52:AC55)","v":404}]
["16:00:00",0,0,0,0,0,0,0,{"$f":"SUM(B57:H57)","v":0},null,7,0,0,0,0,1,2,{"$f":"SUM(K57:Q57)","v":10},null,75,16,0,0,3,2,3.0000000000000004,{"$f":"SUM(T57:Z57)","v":99},null,{"$f":"SUM(I57+R57+AA57)","v":109}]
["16:15:00",0,0,0,0,0,0,0,{"$f":"SUM(B58:H58)","v":0},null,2,1,0,0,3,1,3.0000000000000004,{"$f":"SUM(K58:Q58)","v":10},null,66,13,5,0,3,2,2,{"$f":"SUM(T58:Z58)","v":91},null,{"$f":"SUM(I58+R58+AA58)","v":101}]
["16:30:00",1,0,0,0,0,0,0,{"$f":"SUM(B59:H59)","v":1},null,2,0,0,0,1,0,2,{"$f":"SUM(K59:Q59)","v":5},null,55,13,0,0,2,2,8,{"$f":"SUM(T59:Z59)","v":80},null,{"$f":"SUM(I59+R59+AA59)","v":86}]
["16:45:00",0,0,0,0,0,0,0,{"$f":"SUM(B60:H60)","v":0},null,4,0,0,0,1,1,1,{"$f":"SUM(K60:Q60)","v":7},null,64,13,1,0,1,7,6.0000000000000009,{"$f":"SUM(T60:Z60)","v":92},null,{"$f":"SUM(I60+R60+AA60)","v":99}]
["1 Hr",{"$f":"SUM(B57:B60)","v":1},0,0,0,0,0,0,1,null,{"$f":"SUM(K57:K60)","v":15},1,0,0,5,3,8,32,null,{"$f":"SUM(T57:T60)","v":260},55,6,0,9,13,19,362,null,{"$f":"SUM(AC57:AC60)","v":395}]
["17:00:00",1,0,0,0,0,0,0,{"$f":"SUM(B62:H62)","v":1},null,5,0,0,0,1,1,4,{"$f":"SUM(K62:Q62)","v":11},null,73,16,0,0,4,3.0000000000000004,6.0000000000000009,{"$f":"SUM(T62:Z62)","v":102},null,{"$f":"SUM(I62+R62+AA62)","v":114}]
["17:15:00",0,0,0,0,0,0,0,{"$f":"SUM(B63:H63)","v":0},null,4,0,0,0,0,1,1,{"$f":"SUM(K63:Q63)","v":6},null,63,9,1,0,3,9,5,{"$f":"SUM(T63:Z63)","v":90},null,{"$f":"SUM(I63+R63+AA63)","v":96}]
["17:30:00",0,0,0,0,0,0,0,{"$f":"SUM(B64:H64)","v":0},null,2,1,0,0,1,1,0,{"$f":"SUM(K64:Q64)","v":5},null,82,8,1,0,2,6.0000000000000009,4,{"$f":"SUM(T64:Z64)","v":103},null,{"$f":"SUM(I64+R64+AA64)","v":108}]
["17:45:00",0,0,0,0,0,0,0,{"$f":"SUM(B65:H65)","v":0},null,1,0,0,0,1,0,2,{"$f":"SUM(K65:Q65)","v":4},null,80,5,1,0,3,5,9,{"$f":"SUM(T65:Z65)","v":103},null,{"$f":"SUM(I65+R65+AA65)","v":107}]
["1 Hr",{"$f":"SUM(B62:B65)","v":1},0,0,0,0,0,0,1,null,{"$f":"SUM(K62:K65)","v":12},1,0,0,3,3,7,26,null,{"$f":"SUM(T62:T65)","v":298},38,3,0,12,23,24,398,null,{"$f":"SUM(AC62:AC65)","v":425}]
["18:00:00",0,0,0,0,0,0,0,{"$f":"SUM(B67:H67)","v":0},null,8,1,0,0,1,1,1,{"$f":"SUM(K67:Q67)","v":12},null,76,6,1,0,2,5,4,{"$f":"SUM(T67:Z67)","v":94},null,{"$f":"SUM(I67+R67+AA67)","v":106}]
["18:15:00",0,0,0,0,0,0,0,{"$f":"SUM(B68:H68)","v":0},null,3,0,0,0,1,0,2,{"$f":"SUM(K68:Q68)","v":6},null,70,7,0,0,2,3.0000000000000004,1,{"$f":"SUM(T68:Z68)","v":83},null,{"$f":"SUM(I68+R68+AA68)","v":89}]
["18:30:00",0,0,0,0,0,0,0,{"$f":"SUM(B69:H69)","v":0},null,6,0,0,0,1,1,2,{"$f":"SUM(K69:Q69)","v":10},null,71,8,1,0,2,5,9,{"$f":"SUM(T69:Z69)","v":96},null,{"$f":"SUM(I69+R69+AA69)","v":106}]
["18:45:00",1,0,0,0,0,0,0,{"$f":"SUM(B70:H70)","v":1},null,6,0,0,0,1,1,0,{"$f":"SUM(K70:Q70)","v":8},null,67,3,0,0,1,12.000000000000002,6.0000000000000009,{"$f":"SUM(T70:Z70)","v":89},null,{"$f":"SUM(I70+R70+AA70)","v":98}]
["1 Hr",{"$f":"SUM(B67:B70)","v":1},0,0,0,0,0,0,1,null,{"$f":"SUM(K67:K70)","v":23},1,0,0,4,3,5,36,null,{"$f":"SUM(T67:T70)","v":284},24,2,0,7,25,20,362,null,{"$f":"SUM(AC67:AC70)","v":399}]
[]
["Total",{"$f":"SUM(B71+B66+B61+B56+B51+B46+B41+B36+B31+B26+B21+B16)","v":7},1,0,0,0,1,0,9,null,{"$f":"SUM(K71+K66+K61+K56+K51+K46+K41+K36+K31+K26+K21+K16)","v":109},25,0,0,44,14,67,259,null,{"$f":"SUM(T71+T66+T61+T56+T51+T46+T41+T36+T31+T26+T21+T16)","v":2736},515,51,2,127,190,116,3737,null,{"$f":"SUM(AC71+AC66+AC61+AC56+AC51+AC46+AC41+AC36+AC31+AC26+AC21+AC16)","v":4005}]
[]
["Origin :","Arm B","Fisher's Lane"]
[null,"Destination :",null,"Arm A","A409 South Parade (E)",null,null,null,"Total",null,"Destination :",null,"Arm B","Fisher's Lane",null,null,null,"Total",null,"Destination :",null,"Arm C","A409 South Parade (W)",null,null,null,"Total",null,"Arm Totals"]
[null,{"$f":"$B$10","v":"Car"},{"$f":"$C$10","v":"LGV"},{"$f":"$D$10","v":"OGV1"},{"$f":"$E$10","v":"OGV2"},{"$f":"$F$10","v":"PSV"},{"$f":"$G$10","v":"MC"},{"$f":"$H$10","v":"PC"},null,null,{"$f":"$B$10","v":"Car"},{"$f":"$C$10","v":"LGV"},{"$f":"$D$10","v":"OGV1"},{"$f":"$E$10","v":"OGV2"},{"$f":"$F$10","v":"PSV"},{"$f":"$G$10","v":"MC"},{"$f":"$H$10","v":"PC"},null,null,{"$f":"$B$10","v":"Car"},{"$f":"$C$10","v":"LGV"},{"$f":"$D$10","v":"OGV1"},{"$f":"$E$10","v":"OGV2"},{"$f":"$F$10","v":"PSV"},{"$f":"$G$10","v":"MC"},{"$f":"$H$10","v":"PC"}]
[]
["07:00:00",2,0,0,0,1,0,0,{"$f":"SUM(B79:H79)","v":3},null,0,0,0,0,0,0,0,{"$f":"SUM(K79:Q79)","v":0},null,0,0,0,0,0,0,0,{"$f":"SUM(T79:Z79)","v":0},null,{"$f":"SUM(I79+R79+AA79)","v":3}]
["07:15:00",0,0,0,0,1,0,2,{"$f":"SUM(B80:H80)","v":3},null,0,0,0,0,0,0,0,{"$f":"SUM(K80:Q80)","v":0},null,1,1,0,0,0,1,0,{"$f":"SUM(T80:Z80)","v":3},null,{"$f":"SUM(I80+R80+AA80)","v":6}]
["07:30:00",0,0,0,0,1,1,1,{"$f":"SUM(B81:H81)","v":3},null,0,0,0,0,0,0,0,{"$f":"SUM(K81:Q81)","v":0},null,4,0,0,0,0,0,4,{"$f":"SUM(T81:Z81)","v":8},null,{"$f":"SUM(I81+R81+AA81)","v":11}]
["07:45:00",2,1,0,0,1,0,1,{"$f":"SUM(B82:H82)","v":5},null,0,0,0,0,0,0,0,{"$f":"SUM(K82:Q82)","v":0},null,0,0,0,0,0,0,2,{"$f":"SUM(T82:Z82)","v":2},null,{"$f":"SUM(I82+R82+AA82)","v":7}]
["1 Hr",{"$f":"SUM(B79:B82)","v":4},1,0,0,4,1,4,14,null,{"$f":"SUM(K79:K82)","v":0},0,0,0,0,0,0,0,null,{"$f":"SUM(T79:T82)","v":5},1,0,0,0,1,6,13,null,{"$f":"SUM(AC79:AC82)","v":27}]
["08:00:00",1,0,0,0,1,0,1,{"$f":"SUM(B84:H84)","v":3},null,0,0,0,0,0,0,0,{"$f":"SUM(K84:Q84)","v":0},null,0,0,0,0,0,1,2,{"$f":"SUM(T84:Z84)","v":3},null,{"$f":"SUM(I84+R84+AA84)","v":6}]
["08:15:00",2,0,0,0,1,0,0,{"$f":"SUM(B85:H85)","v":3},null,0,0,0,0,0,0,0,{"$f":"SUM(K85:Q85)","v":0},null,0,0,0,0,0,1,4,{"$f":"SUM(T85:Z85)","v":5},null,{"$f":"SUM(I85+R85+AA85)","v":8}]
["08:30:00",2,1,0,0,1,0,1,{"$f":"SUM(B86:H86)","v":5},null,0,0,0,0,0,0,0,{"$f":"SUM(K86:Q86)","v":0},null,1,0,0,0,0,0,2,{"$f":"SUM(T86:Z86)","v":3},null,{"$f":"SUM(I86+R86+AA86)","v":8}]
["08:45:00",3,3,0,0,1,1,2,{"$f":"SUM(B87:H87)","v":10},null,0,0,0,0,0,0,0,{"$f":"SUM(K87:Q87)","v":0},null,2,0,0,0,0,0,4,{"$f":"SUM(T87:Z87)","v":6},null,{"$f":"SUM(I87+R87+AA87)","v":16}]
["1 Hr",{"$f":"SUM(B84:B87)","v":8},4,0,0,4,1,4,21,null,{"$f":"SUM(K84:K87)","v":0},0,0,0,0,0,0,0,null,{"$f":"SUM(T84:T87)","v":3},0,0,0,0,2,12,17,null,{"$f":"SUM(AC84:AC87)","v":38}]
["09:00:00",7,1,0,0,0,0,1,{"$f":"SUM(B89:H89)","v":9},null,0,0,0,0,0,0,0,{"$f":"SUM(K89:Q89)","v":0},null,0,0,0,0,0,0,4,{"$f":"SUM(T89:Z89)","v":4},null,{"$f":"SUM(I89+R89+AA89)","v":13}]
["09:15:00",2,2,0,0,1,0,5,{"$f":"SUM(B90:H90)","v":10},null,0,0,0,0,0,0,0,{"$f":"SUM(K90:Q90)","v":0},null,3,0,0,0,0,0,1,{"$f":"SUM(T90:Z90)","v":4},null,{"$f":"SUM(I90+R90+AA90)","v":14}]
["09:30:00",4,0,0,0,1,0,0,{"$f":"SUM(B91:H91)","v":5},null,0,0,0,0,0,0,0,{"$f":"SUM(K91:Q91)","v":0},null,3,1,0,0,0,0,0,{"$f":"SUM(T91:Z91)","v":4},null,{"$f":"SUM(I91+R91+AA91)","v":9}]
["09:45:00",2,0,0,0,1,1,4,{"$f":"SUM(B92:H92)","v":8},null,0,0,0,0,0,0,0,{"$f":"SUM(K92:Q92)","v":0},null,0,1,0,0,0,0,0,{"$f":"SUM(T92:Z92)","v":1},null,{"$f":"SUM(I92+R92+AA92)","v":9}]
["1 Hr",{"$f":"SUM(B89:B92)","v":15},3,0,0,3,1,10,32,null,{"$f":"SUM(K89:K92)","v":0},0,0,0,0,0,0,0,null,{"$f":"SUM(T89:T92)","v":6},2,0,0,0,0,5,13,null,{"$f":"SUM(AC89:AC92)","v":45}]
["10:00:00",3,0,0,0,1,0,2,{"$f":"SUM(B94:H94)","v":6},null,0,0,0,0,0,0,0,{"$f":"SUM(K94:Q94)","v":0},null,1,1,0,0,0,0,0,{"$f":"SUM(T94:Z94)","v":2},null,{"$f":"SUM(I94+R94+AA94)","v":8}]
["10:15:00",1,1,0,0,1,0,0,{"$f":"SUM(B95:H95)","v":3},null,0,0,0,0,0,0,0,{"$f":"SUM(K95:Q95)","v":0},null,0,1,0,0,0,0,2,{"$f":"SUM(T95:Z95)","v":3},null,{"$f":"SUM(I95+R95+AA95)","v":6}]
["10:30:00",3,2,0,0,1,0,2,{"$f":"SUM(B96:H96)","v":8},null,0,0,0,0,0,0,0,{"$f":"SUM(K96:Q96)","v":0},null,1,0,0,0,0,1,1,{"$f":"SUM(T96:Z96)","v":3},null,{"$f":"SUM(I96+R96+AA96)","v":11}]
["10:45:00",1,0,0,0,1,0,0,{"$f":"SUM(B97:H97)","v":2},null,0,0,0,0,0,0,0,{"$f":"SUM(K97:Q97)","v":0},null,5,3,0,0,0,0,2,{"$f":"SUM(T97:Z97)","v":10},null,{"$f":"SUM(I97+R97+AA97)","v":12}]
["1 Hr",{"$f":"SUM(B94:B97)","v":8},3,0,0,4,0,4,19,null,{"$f":"SUM(K94:K97)","v":0},0,0,0,0,0,0,0,null,{"$f":"SUM(T94:T97)","v":7},5,0,0,0,1,5,18,null,{"$f":"SUM(AC94:AC97)","v":37}]
["11:00:00",5,1,0,0,1,0,2,{"$f":"SUM(B99:H99)","v":9},null,0,0,0,0,0,0,0,{"$f":"SUM(K99:Q99)","v":0},null,2,1,0,0,0,0,1,{"$f":"SUM(T99:Z99)","v":4},null,{"$f":"SUM(I99+R99+AA99)","v":13}]
["11:15:00",1,0,0,0,1,2,3.0000000000000004,{"$f":"SUM(B100:H100)","v":7},null,0,0,0,0,0,0,0,{"$f":"SUM(K100:Q100)","v":0},null,2,0,0,0,0,1,2,{"$f":"SUM(T100:Z100)","v":5},null,{"$f":"SUM(I100+R100+AA100)","v":12}]
["11:30:00",1,0,0,0,0,0,0,{"$f":"SUM(B101:H101)","v":1},null,0,0,0,0,0,0,0,{"$f":"SUM(K101:Q101)","v":0},null,4,1,0,0,0,0,2,{"$f":"SUM(T101:Z101)","v":7},null,{"$f":"SUM(I101+R101+AA101)","v":8}]
["11:45:00",7,0,0,0,1,0,1,{"$f":"SUM(B102:H102)","v":9},null,0,0,0,0,0,0,0,{"$f":"SUM(K102:Q102)","v":0},null,3,0,0,0,0,1,4,{"$f":"SUM(T102:Z102)","v":8},null,{"$f":"SUM(I102+R102+AA102)","v":17}]
["1 Hr",{"$f":"SUM(B99:B102)","v":14},1,0,0,3,2,6,26,null,{"$f":"SUM(K99:K102)","v":0},0,0,0,0,0,0,0,null,{"$f":"SUM(T99:T102)","v":11},2,0,0,0,2,9,24,null,{"$f":"SUM(AC99:AC102)","v":50}]
["12:00:00",4,1,0,0,1,2,0,{"$f":"SUM(B104:H104)","v":8},null,0,0,0,0,0,0,0,{"$f":"SUM(K104:Q104)","v":0},null,2,0,0,0,0,0,3.0000000000000004,{"$f":"SUM(T104:Z104)","v":5},null,{"$f":"SUM(I104+R104+AA104)","v":13}]
["12:15:00",2,1,0,0,1,1,0,{"$f":"SUM(B105:H105)","v":5},null,0,0,0,0,0,0,0,{"$f":"SUM(K105:Q105)","v":0},null,1,1,0,0,0,0,1,{"$f":"SUM(T105:Z105)","v":3},null,{"$f":"SUM(I105+R105+AA105)","v":8}]
["12:30:00",4,1,0,0,1,1,0,{"$f":"SUM(B106:H106)","v":7},null,0,0,0,0,0,0,0,{"$f":"SUM(K106:Q106)","v":0},null,2,0,0,0,0,1,0,{"$f":"SUM(T106:Z106)","v":3},null,{"$f":"SUM(I106+R106+AA106)","v":10}]
["12:45:00",4,0,0,0,1,0,2,{"$f":"SUM(B107:H107)","v":7},null,0,0,0,0,0,0,0,{"$f":"SUM(K107:Q107)","v":0},null,2,1,0,0,0,0,4,{"$f":"SUM(T107:Z107)","v":7},null,{"$f":"SUM(I107+R107+AA107)","v":14}]
["1 Hr",{"$f":"SUM(B104:B107)","v":14},3,0,0,4,4,2,27,null,{"$f":"SUM(K104:K107)","v":0},0,0,0,0,0,0,0,null,{"$f":"SUM(T104:T107)","v":7},2,0,0,0,1,8,18,null,{"$f":"SUM(AC104:AC107)","v":45}]
["13:00:00",5,0,0,0,1,0,3.0000000000000004,{"$f":"SUM(B109:H109)","v":9},null,0,0,0,0,0,0,0,{"$f":"SUM(K109:Q109)","v":0},null,3,0,0,0,0,0,2,{"$f":"SUM(T109:Z109)","v":5},null,{"$f":"SUM(I109+R109+AA109)","v":14}]
["13:15:00",2,1,0,0,0,2,1,{"$f":"SUM(B110:H110)","v":6},null,0,0,0,0,0,0,0,{"$f":"SUM(K110:Q110)","v":0},null,4,0,0,0,0,0,2,{"$f":"SUM(T110:Z110)","v":6},null,{"$f":"SUM(I110+R110+AA110)","v":12}]
["13:30:00",2,0,0,0,2,0,1,{"$f":"SUM(B111:H111)","v":5},null,0,0,0,0,0,0,0,{"$f":"SUM(K111:Q111)","v":0},null,5,0,0,0,0,0,2,{"$f":"SUM(T111:Z111)","v":7},null,{"$f":"SUM(I111+R111+AA111)","v":12}]
["13:45:00",0,0,0,0,0,1,2,{"$f":"SUM(B112:H112)","v":3},null,0,0,0,0,0,0,0,{"$f":"SUM(K112:Q112)","v":0},null,1,0,0,0,0,0,1,{"$f":"SUM(T112:Z112)","v":2},null,{"$f":"SUM(I112+R112+AA112)","v":5}]
["1 Hr",{"$f":"SUM(B109:B112)","v":9},1,0,0,3,3,7,23,null,{"$f":"SUM(K109:K112)","v":0},0,0,0,0,0,0,0,null,{"$f":"SUM(T109:T112)","v":13},0,0,0,0,0,7,20,null,{"$f":"SUM(AC109:AC112)","v":43}]
["14:00:00",4,0,0,0,1,2,1,{"$f":"SUM(B114:H114)","v":8},null,0,0,0,0,0,0,0,{"$f":"SUM(K114:Q114)","v":0},null,2,0,0,0,0,0,1,{"$f":"SUM(T114:Z114)","v":3},null,{"$f":"SUM(I114+R114+AA114)","v":11}]
["14:15:00",7,0,0,0,1,0,2,{"$f":"SUM(B115:H115)","v":10},null,0,0,0,0,0,0,0,{"$f":"SUM(K115:Q115)","v":0},null,4,0,0,0,0,2,2,{"$f":"SUM(T115:Z115)","v":8},null,{"$f":"SUM(I115+R115+AA115)","v":18}]
["14:30:00",3,0,0,0,1,0,3.0000000000000004,{"$f":"SUM(B116:H116)","v":7},null,0,0,0,0,0,0,0,{"$f":"SUM(K116:Q116)","v":0},null,1,0,0,0,0,0,5,{"$f":"SUM(T116:Z116)","v":6},null,{"$f":"SUM(I116+R116+AA116)","v":13}]
["14:45:00",3,0,0,0,1,0,3.0000000000000004,{"$f":"SUM(B117:H117)","v":7},null,0,0,0,0,0,0,0,{"$f":"SUM(K117:Q117)","v":0},null,1,0,0,0,0,1,3.0000000000000004,{"$f":"SUM(T117:Z117)","v":5},null,{"$f":"SUM(I117+R117+AA117)","v":12}]
["1 Hr",{"$f":"SUM(B114:B117)","v":17},0,0,0,4,2,9,32,null,{"$f":"SUM(K114:K117)","v":0},0,0,0,0,0,0,0,null,{"$f":"SUM(T114:T117)","v":8},0,0,0,0,3,11,22,null,{"$f":"SUM(AC114:AC117)","v":54}]
["15:00:00",6,0,0,0,1,1,0,{"$f":"SUM(B119:H119)","v":8},null,0,0,0,0,0,0,0,{"$f":"SUM(K119:Q119)","v":0},null,5,0,0,0,0,0,2,{"$f":"SUM(T119:Z119)","v":7},null,{"$f":"SUM(I119+R119+AA119)","v":15}]
["15:15:00",2,0,0,0,2,1,1,{"$f":"SUM(B120:H120)","v":6},null,0,0,0,0,0,0,0,{"$f":"SUM(K120:Q120)","v":0},null,4,0,0,0,0,0,4,{"$f":"SUM(T120:Z120)","v":8},null,{"$f":"SUM(I120+R120+AA120)","v":14}]
["15:30:00",3,1,0,0,1,0,2,{"$f":"SUM(B121:H121)","v":7},null,0,0,0,0,0,0,0,{"$f":"SUM(K121:Q121)","v":0},null,1,0,0,0,0,0,0,{"$f":"SUM(T121:Z121)","v":1},null,{"$f":"SUM(I121+R121+AA121)","v":8}]
["15:45:00",3,0,0,0,0,0,0,{"$f":"SUM(B122:H122)","v":3},null,0,0,0,0,0,0,0,{"$f":"SUM(K122:Q122)","v":0},null,2,0,0,0,0,1,4,{"$f":"SUM(T122:Z122)","v":7},null,{"$f":"SUM(I122+R122+AA122)","v":10}]
["1 Hr",{"$f":"SUM(B119:B122)","v":14},1,0,0,4,2,3,24,null,{"$f":"SUM(K119:K122)","v":0},0,0,0,0,0,0,0,null,{"$f":"SUM(T119:T122)","v":12},0,0,0,0,1,10,23,null,{"$f":"SUM(AC119:AC122)","v":47}]
["16:00:00",1,0,0,0,1,0,1,{"$f":"SUM(B124:H124)","v":3},null,0,0,0,0,0,0,0,{"$f":"SUM(K124:Q124)","v":0},null,0,1,0,0,0,0,0,{"$f":"SUM(T124:Z124)","v":1},null,{"$f":"SUM(I124+R124+AA124)","v":4}]
["16:15:00",1,0,0,0,1,1,5,{"$f":"SUM(B125:H125)","v":8},null,0,0,0,0,0,0,0,{"$f":"SUM(K125:Q125)","v":0},null,3,0,0,0,0,1,6.0000000000000009,{"$f":"SUM(T125:Z125)","v":10},null,{"$f":"SUM(I125+R125+AA125)","v":18}]
["16:30:00",2,0,0,0,1,1,4,{"$f":"SUM(B126:H126)","v":8},null,0,0,0,0,0,0,0,{"$f":"SUM(K126:Q126)","v":0},null,2,2,0,0,0,2,5,{"$f":"SUM(T126:Z126)","v":11},null,{"$f":"SUM(I126+R126+AA126)","v":19}]
["16:45:00",2,0,0,0,1,1,2,{"$f":"SUM(B127:H127)","v":6},null,0,0,0,0,0,0,0,{"$f":"SUM(K127:Q127)","v":0},null,4,1,0,0,0,1,5,{"$f":"SUM(T127:Z127)","v":11},null,{"$f":"SUM(I127+R127+AA127)","v":17}]
["1 Hr",{"$f":"SUM(B124:B127)","v":6},0,0,0,4,3,12,25,null,{"$f":"SUM(K124:K127)","v":0},0,0,0,0,0,0,0,null,{"$f":"SUM(T124:T127)","v":9},4,0,0,0,4,16,33,null,{"$f":"SUM(AC124:AC127)","v":58}]
["17:00:00",3,0,0,0,1,0,7,{"$f":"SUM(B129:H129)","v":11},null,0,0,0,0,0,0,0,{"$f":"SUM(K129:Q129)","v":0},null,2,0,0,0,0,1,2,{"$f":"SUM(T129:Z129)","v":5},null,{"$f":"SUM(I129+R129+AA129)","v":16}]
["17:15:00",5,2,0,0,1,0,0,{"$f":"SUM(B130:H130)","v":8},null,0,0,0,0,0,0,0,{"$f":"SUM(K130:Q130)","v":0},null,0,0,0,0,0,0,3.0000000000000004,{"$f":"SUM(T130:Z130)","v":3.0000000000000004},null,{"$f":"SUM(I130+R130+AA130)","v":11}]
["17:30:00",7,0,0,0,0,0,6.0000000000000009,{"$f":"SUM(B131:H131)","v":13},null,0,0,0,0,0,0,0,{"$f":"SUM(K131:Q131)","v":0},null,2,0,0,0,0,2,2,{"$f":"SUM(T131:Z131)","v":6},null,{"$f":"SUM(I131+R131+AA131)","v":19}]
["17:45:00",2,0,0,0,2,0,2,{"$f":"SUM(B132:H132)","v":6},null,0,0,0,0,0,0,0,{"$f":"SUM(K132:Q132)","v":0},null,2,0,0,0,0,0,4,{"$f":"SUM(T132:Z132)","v":6},null,{"$f":"SUM(I132+R132+AA132)","v":12}]
["1 Hr",{"$f":"SUM(B129:B132)","v":17},2,0,0,4,0,15,38,null,{"$f":"SUM(K129:K132)","v":0},0,0,0,0,0,0,0,null,{"$f":"SUM(T129:T132)","v":6},0,0,0,0,3,11,20,null,{"$f":"SUM(AC129:AC132)","v":58}]
["18:00:00",3,0,0,0,0,0,0,{"$f":"SUM(B134:H134)","v":3},null,0,0,0,0,0,0,0,{"$f":"SUM(K134:Q134)","v":0},null,1,0,0,0,0,1,2,{"$f":"SUM(T134:Z134)","v":4},null,{"$f":"SUM(I134+R134+AA134)","v":7}]
["18:15:00",1,0,0,0,1,0,2,{"$f":"SUM(B135:H135)","v":4},null,0,0,0,0,0,0,0,{"$f":"SUM(K135:Q135)","v":0},null,1,0,0,0,0,2,4,{"$f":"SUM(T135:Z135)","v":7},null,{"$f":"SUM(I135+R135+AA135)","v":11}]
["18:30:00",2,0,0,0,1,0,1,{"$f":"SUM(B136:H136)","v":4},null,0,0,0,0,0,0,0,{"$f":"SUM(K136:Q136)","v":0},null,2,0,0,0,0,0,4,{"$f":"SUM(T136:Z136)","v":6},null,{"$f":"SUM(I136+R136+AA136)","v":10}]
["18:45:00",3,0,0,0,1,1,0,{"$f":"SUM(B137:H137)","v":5},null,0,0,0,0,0,0,0,{"$f":"SUM(K137:Q137)","v":0},null,3,0,0,0,0,2,2,{"$f":"SUM(T137:Z137)","v":7},null,{"$f":"SUM(I137+R137+AA137)","v":12}]
["1 Hr",{"$f":"SUM(B134:B137)","v":9},0,0,0,3,1,3,16,null,{"$f":"SUM(K134:K137)","v":0},0,0,0,0,0,0,0,null,{"$f":"SUM(T134:T137)","v":7},0,0,0,0,5,12,24,null,{"$f":"SUM(AC134:AC137)","v":40}]
[]
["Total",{"$f":"SUM(B138+B133+B128+B123+B118+B113+B108+B103+B98+B93+B88+B83)","v":135},19,0,0,44,20,79,297,null,{"$f":"SUM(K138+K133+K128+K123+K118+K113+K108+K103+K98+K93+K88+K83)","v":0},0,0,0,0,0,0,0,null,{"$f":"SUM(T138+T133+T128+T123+T118+T113+T108+T103+T98+T93+T88+T83)","v":94},16,0,0,0,23,112,245,null,{"$f":"SUM(AC138+AC133+AC128+AC123+AC118+AC113+AC108+AC103+AC98+AC93+AC88+AC83)","v":542}]
[]
["Origin :","Arm C","A409 South Parade (W)"]
[null,"Destination :",null,"Arm A","A409 South Parade (E)",null,null,null,"Total",null,"Destination :",null,"Arm B","Fisher's Lane",null,null,null,"Total",null,"Destination :",null,"Arm C","A409 South Parade (W)",null,null,null,"Total",null,"Arm Totals"]
[null,{"$f":"$B$10","v":"Car"},{"$f":"$C$10","v":"LGV"},{"$f":"$D$10","v":"OGV1"},{"$f":"$E$10","v":"OGV2"},{"$f":"$F$10","v":"PSV"},{"$f":"$G$10","v":"MC"},{"$f":"$H$10","v":"PC"},null,null,{"$f":"$B$10","v":"Car"},{"$f":"$C$10","v":"LGV"},{"$f":"$D$10","v":"OGV1"},{"$f":"$E$10","v":"OGV2"},{"$f":"$F$10","v":"PSV"},{"$f":"$G$10","v":"MC"},{"$f":"$H$10","v":"PC"},null,null,{"$f":"$B$10","v":"Car"},{"$f":"$C$10","v":"LGV"},{"$f":"$D$10","v":"OGV1"},{"$f":"$E$10","v":"OGV2"},{"$f":"$F$10","v":"PSV"},{"$f":"$G$10","v":"MC"},{"$f":"$H$10","v":"PC"}]
[]
["07:00:00",44,13,0,0,3,0,2,{"$f":"SUM(B146:H146)","v":62},null,2,1,0,0,0,0,1,{"$f":"SUM(K146:Q146)","v":4},null,0,0,0,0,0,0,0,{"$f":"SUM(T146:Z146)","v":0},null,{"$f":"SUM(I146+R146+AA146)","v":66}]
["07:15:00",40,15,1,0,4,3.0000000000000004,8,{"$f":"SUM(B147:H147)","v":71},null,2,0,0,0,0,0,5,{"$f":"SUM(K147:Q147)","v":7},null,0,0,0,0,0,0,0,{"$f":"SUM(T147:Z147)","v":0},null,{"$f":"SUM(I147+R147+AA147)","v":78}]
["07:30:00",56,30,2,0,3,6.0000000000000009,5,{"$f":"SUM(B148:H148)","v":102},null,3,0,0,0,0,0,5,{"$f":"SUM(K148:Q148)","v":8},null,0,0,0,0,0,0,0,{"$f":"SUM(T148:Z148)","v":0},null,{"$f":"SUM(I148+R148+AA148)","v":110}]
["07:45:00",66,25,4,0,3,3.0000000000000004,3.0000000000000004,{"$f":"SUM(B149:H149)","v":104},null,2,0,0,0,0,0,2,{"$f":"SUM(K149:Q149)","v":4},null,0,0,0,0,0,0,0,{"$f":"SUM(T149:Z149)","v":0},null,{"$f":"SUM(I149+R149+AA149)","v":108}]
["1 Hr",{"$f":"SUM(B146:B149)","v":206},83,7,0,13,12.000000000000002,18,339,null,{"$f":"SUM(K146:K149)","v":9},1,0,0,0,0,13,23,null,{"$f":"SUM(T146:T149)","v":0},0,0,0,0,0,0,0,null,{"$f":"SUM(AC146:AC149)","v":362}]
["08:00:00",69,13,2,0,3,4,9,{"$f":"SUM(B151:H151)","v":100},null,2,1,0,0,1,0,6.0000000000000009,{"$f":"SUM(K151:Q151)","v":10},null,0,0,0,0,0,0,0,{"$f":"SUM(T151:Z151)","v":0},null,{"$f":"SUM(I151+R151+AA151)","v":110}]
["08:15:00",68,16,1,0,2,6.0000000000000009,9,{"$f":"SUM(B152:H152)","v":102},null,2,0,0,0,0,0,4,{"$f":"SUM(K152:Q152)","v":6},null,1,0,0,0,0,0,0,{"$f":"SUM(T152:Z152)","v":1},null,{"$f":"SUM(I152+R152+AA152)","v":109}]
["08:30:00",78,12,3,0,3,1,6.0000000000000009,{"$f":"SUM(B153:H153)","v":103},null,5,1,0,0,0,1,6.0000000000000009,{"$f":"SUM(K153:Q153)","v":13},null,1,0,0,0,0,0,0,{"$f":"SUM(T153:Z153)","v":1},null,{"$f":"SUM(I153+R153+AA153)","v":117}]
["08:45:00",63,14,4,0,2,4,4,{"$f":"SUM(B154:H154)","v":91},null,2,0,0,0,0,0,3.0000000000000004,{"$f":"SUM(K154:Q154)","v":5},null,0,0,0,0,0,0,0,{"$f":"SUM(T154:Z154)","v":0},null,{"$f":"SUM(I154+R154+AA154)","v":96}]
["1 Hr",{"$f":"SUM(B151:B154)","v":278},55,10,0,10,15,28,396,null,{"$f":"SUM(K151:K154)","v":11},2,0,0,1,1,19,34,null,{"$f":"SUM(T151:T154)","v":2},0,0,0,0,0,0,2,null,{"$f":"SUM(AC151:AC154)","v":432}]
["09:00:00",59,12,5,0,4,2,2,{"$f":"SUM(B156:H156)","v":84},null,1,1,0,0,0,0,1,{"$f":"SUM(K156:Q156)","v":3},null,1,0,0,0,0,0,0,{"$f":"SUM(T156:Z156)","v":1},null,{"$f":"SUM(I156+R156+AA156)","v":88}]
["09:15:00",60,13,1,0,2,1,4,{"$f":"SUM(B157:H157)","v":81},null,2,0,0,0,0,0,4,{"$f":"SUM(K157:Q157)","v":6},null,0,0,0,0,0,0,0,{"$f":"SUM(T157:Z157)","v":0},null,{"$f":"SUM(I157+R157+AA157)","v":87}]
["09:30:00",51,25,1,0,3,4,4,{"$f":"SUM(B158:H158)","v":88},null,0,0,0,0,0,1,5,{"$f":"SUM(K158:Q158)","v":6},null,0,1,0,0,0,0,0,{"$f":"SUM(T158:Z158)","v":1},null,{"$f":"SUM(I158+R158+AA158)","v":95}]
["09:45:00",61,22,1,0,2,1,3.0000000000000004,{"$f":"SUM(B159:H159)","v":90},null,3,0,0,0,0,0,2,{"$f":"SUM(K159:Q159)","v":5},null,0,0,0,0,0,0,0,{"$f":"SUM(T159:Z159)","v":0},null,{"$f":"SUM(I159+R159+AA159)","v":95}]
["1 Hr",{"$f":"SUM(B156:B159)","v":231},72,8,0,11,8,13,343,null,{"$f":"SUM(K156:K159)","v":6},1,0,0,0,1,12,20,null,{"$f":"SUM(T156:T159)","v":1},1,0,0,0,0,0,2,null,{"$f":"SUM(AC156:AC159)","v":365}]
["10:00:00",61,21,0,0,2,2,1,{"$f":"SUM(B161:H161)","v":87},null,3,0,0,0,0,1,2,{"$f":"SUM(K161:Q161)","v":6},null,1,0,0,0,0,0,0,{"$f":"SUM(T161:Z161)","v":1},null,{"$f":"SUM(I161+R161+AA161)","v":94}]
["10:15:00",48,8,3,0,3,3.0000000000000004,2,{"$f":"SUM(B162:H162)","v":67},null,1,0,0,0,0,1,3.0000000000000004,{"$f":"SUM(K162:Q162)","v":5},null,0,0,0,0,0,0,0,{"$f":"SUM(T162:Z162)","v":0},null,{"$f":"SUM(I162+R162+AA162)","v":72}]
["10:30:00",46,15,1,0,3,1,3.0000000000000004,{"$f":"SUM(B163:H163)","v":69},null,4,2,0,0,0,0,1,{"$f":"SUM(K163:Q163)","v":7},null,0,0,0,0,0,0,0,{"$f":"SUM(T163:Z163)","v":0},null,{"$f":"SUM(I163+R163+AA163)","v":76}]
["10:45:00",61,4,2,0,2,4,0,{"$f":"SUM(B164:H164)","v":73},null,1,1,0,0,0,0,2,{"$f":"SUM(K164:Q164)","v":4},null,0,0,0,0,0,0,0,{"$f":"SUM(T164:Z164)","v":0},null,{"$f":"SUM(I164+R164+AA164)","v":77}]
["1 Hr",{"$f":"SUM(B161:B164)","v":216},48,6,0,10,10,6,296,null,{"$f":"SUM(K161:K164)","v":9},3,0,0,0,2,8,22,null,{"$f":"SUM(T161:T164)","v":1},0,0,0,0,0,0,1,null,{"$f":"SUM(AC161:AC164)","v":319}]
["11:00:00",58,12,0,0,3,4,0,{"$f":"SUM(B166:H166)","v":77},null,2,0,0,0,0,0,1,{"$f":"SUM(K166:Q166)","v":3},null,0,0,0,0,0,0,0,{"$f":"SUM(T166:Z166)","v":0},null,{"$f":"SUM(I166+R166+AA166)","v":80}]
["11:15:00",49,14,0,0,2,5,3.0000000000000004,{"$f":"SUM(B167:H167)","v":73},null,4,1,0,0,0,0,3.0000000000000004,{"$f":"SUM(K167:Q167)","v":8},null,0,1,0,0,0,0,0,{"$f":"SUM(T167:Z167)","v":1},null,{"$f":"SUM(I167+R167+AA167)","v":82}]
["11:30:00",50,21,0,0,2,5,3.0000000000000004,{"$f":"SUM(B168:H168)","v":81},null,2,2,0,0,0,0,1,{"$f":"SUM(K168:Q168)","v":5},null,0,0,0,0,0,0,0,{"$f":"SUM(T168:Z168)","v":0},null,{"$f":"SUM(I168+R168+AA168)","v":86}]
["11:45:00",46,11,3,0,2,4,1,{"$f":"SUM(B169:H169)","v":67},null,6,0,0,0,0,3.0000000000000004,1,{"$f":"SUM(K169:Q169)","v":10},null,1,0,0,0,0,0,0,{"$f":"SUM(T169:Z169)","v":1},null,{"$f":"SUM(I169+R169+AA169)","v":78}]
["1 Hr",{"$f":"SUM(B166:B169)","v":203},58,3,0,9,18,7.0000000000000009,298,null,{"$f":"SUM(K166:K169)","v":14},3,0,0,0,3.0000000000000004,6,26,null,{"$f":"SUM(T166:T169)","v":1},1,0,0,0,0,0,2,null,{"$f":"SUM(AC166:AC169)","v":326}]
["12:00:00",47,16,2,0,3,1,2,{"$f":"SUM(B171:H171)","v":71},null,1,1,0,0,0,0,2,{"$f":"SUM(K171:Q171)","v":4},null,0,0,0,0,0,0,0,{"$f":"SUM(T171:Z171)","v":0},null,{"$f":"SUM(I171+R171+AA171)","v":75}]
["12:15:00",53,10,1,0,2,2,3.0000000000000004,{"$f":"SUM(B172:H172)","v":71},null,2,0,0,0,0,0,3.0000000000000004,{"$f":"SUM(K172:Q172)","v":5},null,0,0,0,0,0,0,0,{"$f":"SUM(T172:Z172)","v":0},null,{"$f":"SUM(I172+R172+AA172)","v":76}]
["12:30:00",51,7,2,0,2,4,2,{"$f":"SUM(B173:H173)","v":68},null,2,0,0,0,0,1,0,{"$f":"SUM(K173:Q173)","v":3},null,0,0,0,0,0,0,0,{"$f":"SUM(T173:Z173)","v":0},null,{"$f":"SUM(I173+R173+AA173)","v":71}]
["12:45:00",52,11,0,0,3,4,1,{"$f":"SUM(B174:H174)","v":71},null,6,0,0,0,0,1,1,{"$f":"SUM(K174:Q174)","v":8},null,0,0,0,0,0,0,0,{"$f":"SUM(T174:Z174)","v":0},null,{"$f":"SUM(I174+R174+AA174)","v":79}]
["1 Hr",{"$f":"SUM(B171:B174)","v":203},44,5,0,10,11,8,281,null,{"$f":"SUM(K171:K174)","v":11},1,0,0,0,2,6,20,null,{"$f":"SUM(T171:T174)","v":0},0,0,0,0,0,0,0,null,{"$f":"SUM(AC171:AC174)","v":301}]
["13:00:00",57,12,1,0,3,2,0,{"$f":"SUM(B176:H176)","v":75},null,2,0,0,0,0,1,5,{"$f":"SUM(K176:Q176)","v":8},null,0,0,0,0,0,0,0,{"$f":"SUM(T176:Z176)","v":0},null,{"$f":"SUM(I176+R176+AA176)","v":83}]
["13:15:00",43,8,1,0,3,9,2,{"$f":"SUM(B177:H177)","v":66},null,4,0,0,0,0,1,1,{"$f":"SUM(K177:Q177)","v":6},null,1,0,0,0,0,0,0,{"$f":"SUM(T177:Z177)","v":1},null,{"$f":"SUM(I177+R177+AA177)","v":73}]
["13:30:00",40,5,1,0,2,4,0,{"$f":"SUM(B178:H178)","v":52},null,2,0,0,0,0,0,0,{"$f":"SUM(K178:Q178)","v":2},null,0,0,0,0,0,0,0,{"$f":"SUM(T178:Z178)","v":0},null,{"$f":"SUM(I178+R178+AA178)","v":54}]
["13:45:00",43,11,0,0,3,3.0000000000000004,3.0000000000000004,{"$f":"SUM(B179:H179)","v":63},null,1,0,0,0,0,0,4,{"$f":"SUM(K179:Q179)","v":5},null,0,0,0,0,0,0,0,{"$f":"SUM(T179:Z179)","v":0},null,{"$f":"SUM(I179+R179+AA179)","v":68}]
["1 Hr",{"$f":"SUM(B176:B179)","v":183},36,3,0,11,18,5,256,null,{"$f":"SUM(K176:K179)","v":9},0,0,0,0,2,10,21,null,{"$f":"SUM(T176:T179)","v":1},0,0,0,0,0,0,1,null,{"$f":"SUM(AC176:AC179)","v":278}]
["14:00:00",39,6,2,0,3,2,0,{"$f":"SUM(B181:H181)","v":52},null,0,1,0,0,0,0,4,{"$f":"SUM(K181:Q181)","v":5},null,0,0,0,0,0,0,0,{"$f":"SUM(T181:Z181)","v":0},null,{"$f":"SUM(I181+R181+AA181)","v":57}]
["14:15:00",55,8,1,0,2,4,1,{"$f":"SUM(B182:H182)","v":71},null,1,0,0,0,0,4,0,{"$f":"SUM(K182:Q182)","v":5},null,1,0,0,0,0,0,0,{"$f":"SUM(T182:Z182)","v":1},null,{"$f":"SUM(I182+R182+AA182)","v":77}]
["14:30:00",44,4,1,0,4,10,1,{"$f":"SUM(B183:H183)","v":64},null,4,1,0,0,0,1,4,{"$f":"SUM(K183:Q183)","v":10},null,0,0,0,0,0,0,0,{"$f":"SUM(T183:Z183)","v":0},null,{"$f":"SUM(I183+R183+AA183)","v":74}]
["14:45:00",52,8,2,0,3,2,7,{"$f":"SUM(B184:H184)","v":74},null,1,1,0,0,0,2,4,{"$f":"SUM(K184:Q184)","v":8},null,0,0,0,0,0,0,0,{"$f":"SUM(T184:Z184)","v":0},null,{"$f":"SUM(I184+R184+AA184)","v":82}]
["1 Hr",{"$f":"SUM(B181:B184)","v":190},26,6,0,12,18,9,261,null,{"$f":"SUM(K181:K184)","v":6},3,0,0,0,7,12,28,null,{"$f":"SUM(T181:T184)","v":1},0,0,0,0,0,0,1,null,{"$f":"SUM(AC181:AC184)","v":290}]
["15:00:00",62,5,0,0,2,7,1,{"$f":"SUM(B186:H186)","v":77},null,2,0,0,0,0,0,5,{"$f":"SUM(K186:Q186)","v":7},null,0,0,0,0,0,0,0,{"$f":"SUM(T186:Z186)","v":0},null,{"$f":"SUM(I186+R186+AA186)","v":84}]
["15:15:00",49,7,1,0,2,5,1,{"$f":"SUM(B187:H187)","v":65},null,6,1,1,0,0,0,3.0000000000000004,{"$f":"SUM(K187:Q187)","v":11},null,1,0,0,0,0,0,0,{"$f":"SUM(T187:Z187)","v":1},null,{"$f":"SUM(I187+R187+AA187)","v":77}]
["15:30:00",48,5,0,0,3,3.0000000000000004,2,{"$f":"SUM(B188:H188)","v":61},null,4,1,0,0,0,1,3.0000000000000004,{"$f":"SUM(K188:Q188)","v":9},null,0,0,0,0,0,0,0,{"$f":"SUM(T188:Z188)","v":0},null,{"$f":"SUM(I188+R188+AA188)","v":70}]
["15:45:00",44,5,0,0,3,1,3.0000000000000004,{"$f":"SUM(B189:H189)","v":56},null,2,0,0,0,0,0,2,{"$f":"SUM(K189:Q189)","v":4},null,0,0,0,0,0,0,0,{"$f":"SUM(T189:Z189)","v":0},null,{"$f":"SUM(I189+R189+AA189)","v":60}]
["1 Hr",{"$f":"SUM(B186:B189)","v":203},22,1,0,10,16,7,259,null,{"$f":"SUM(K186:K189)","v":14},2,1,0,0,1,13,31,null,{"$f":"SUM(T186:T189)","v":1},0,0,0,0,0,0,1,null,{"$f":"SUM(AC186:AC189)","v":291}]
["16:00:00",47,8,2,0,2,4,5,{"$f":"SUM(B191:H191)","v":68},null,3,1,0,0,0,0,4,{"$f":"SUM(K191:Q191)","v":8},null,1,0,0,0,0,0,0,{"$f":"SUM(T191:Z191)","v":1},null,{"$f":"SUM(I191+R191+AA191)","v":77}]
["16:15:00",48,7,0,0,3,1,0,{"$f":"SUM(B192:H192)","v":59},null,4,0,1,0,0,0,5,{"$f":"SUM(K192:Q192)","v":10},null,0,0,0,0,0,0,0,{"$f":"SUM(T192:Z192)","v":0},null,{"$f":"SUM(I192+R192+AA192)","v":69}]
["16:30:00",53,5,0,0,2,2,2,{"$f":"SUM(B193:H193)","v":64},null,2,0,0,0,0,3.0000000000000004,3.0000000000000004,{"$f":"SUM(K193:Q193)","v":8},null,0,0,0,0,0,0,0,{"$f":"SUM(T193:Z193)","v":0},null,{"$f":"SUM(I193+R193+AA193)","v":72}]
["16:45:00",45,4,1,0,3,3.0000000000000004,3.0000000000000004,{"$f":"SUM(B194:H194)","v":59},null,7,0,0,0,0,2,5,{"$f":"SUM(K194:Q194)","v":14},null,0,0,0,0,0,0,0,{"$f":"SUM(T194:Z194)","v":0},null,{"$f":"SUM(I194+R194+AA194)","v":73}]
["1 Hr",{"$f":"SUM(B191:B194)","v":193},24,3,0,10,10,10,250,null,{"$f":"SUM(K191:K194)","v":16},1,1,0,0,5,17,40,null,{"$f":"SUM(T191:T194)","v":1},0,0,0,0,0,0,1,null,{"$f":"SUM(AC191:AC194)","v":291}]
["17:00:00",59,6,0,0,2,1,5,{"$f":"SUM(B196:H196)","v":73},null,8,0,0,0,0,1,2,{"$f":"SUM(K196:Q196)","v":11},null,1,0,0,0,0,0,0,{"$f":"SUM(T196:Z196)","v":1},null,{"$f":"SUM(I196+R196+AA196)","v":85}]
["17:15:00",57,4,1,0,3,6.0000000000000009,1,{"$f":"SUM(B197:H197)","v":72},null,3,0,0,0,0,0,3.0000000000000004,{"$f":"SUM(K197:Q197)","v":6},null,0,0,0,0,0,0,0,{"$f":"SUM(T197:Z197)","v":0},null,{"$f":"SUM(I197+R197+AA197)","v":78}]
["17:30:00",44,3,0,0,2,5,8,{"$f":"SUM(B198:H198)","v":62},null,1,0,0,0,0,0,2,{"$f":"SUM(K198:Q198)","v":3},null,0,0,0,0,0,1,0,{"$f":"SUM(T198:Z198)","v":1},null,{"$f":"SUM(I198+R198+AA198)","v":66}]
["17:45:00",59,3,0,0,3,2,5,{"$f":"SUM(B199:H199)","v":72},null,7,1,0,0,0,1,5,{"$f":"SUM(K199:Q199)","v":14},null,1,0,0,0,0,0,0,{"$f":"SUM(T199:Z199)","v":1},null,{"$f":"SUM(I199+R199+AA199)","v":87}]
["1 Hr",{"$f":"SUM(B196:B199)","v":219},16,1,0,10,14,19,279,null,{"$f":"SUM(K196:K199)","v":19},1,0,0,0,2,12,34,null,{"$f":"SUM(T196:T199)","v":2},0,0,0,0,1,0,3,null,{"$f":"SUM(AC196:AC199)","v":316}]
["18:00:00",41,1,0,0,2,3.0000000000000004,7,{"$f":"SUM(B201:H201)","v":54},null,0,0,0,0,0,2,2,{"$f":"SUM(K201:Q201)","v":4},null,2,0,0,0,0,0,0,{"$f":"SUM(T201:Z201)","v":2},null,{"$f":"SUM(I201+R201+AA201)","v":60}]
["18:15:00",61,1,0,0,2,5,2,{"$f":"SUM(B202:H202)","v":71},null,1,0,0,0,0,0,2,{"$f":"SUM(K202:Q202)","v":3},null,1,0,0,0,0,0,0,{"$f":"SUM(T202:Z202)","v":1},null,{"$f":"SUM(I202+R202+AA202)","v":75}]
["18:30:00",52,3,0,0,2,11,1,{"$f":"SUM(B203:H203)","v":69},null,1,0,0,0,0,1,5,{"$f":"SUM(K203:Q203)","v":7},null,0,0,0,0,0,0,0,{"$f":"SUM(T203:Z203)","v":0},null,{"$f":"SUM(I203+R203+AA203)","v":76}]
["18:45:00",45,5,0,0,3,12.000000000000002,2,{"$f":"SUM(B204:H204)","v":67},null,5,1,0,0,0,2,3.0000000000000004,{"$f":"SUM(K204:Q204)","v":11},null,0,0,0,0,0,0,0,{"$f":"SUM(T204:Z204)","v":0},null,{"$f":"SUM(I204+R204+AA204)","v":78}]
["1 Hr",{"$f":"SUM(B201:B204)","v":199},10,0,0,9,31,12,261,null,{"$f":"SUM(K201:K204)","v":7},1,0,0,0,5,12,25,null,{"$f":"SUM(T201:T204)","v":3},0,0,0,0,0,0,3,null,{"$f":"SUM(AC201:AC204)","v":289}]
[]
["Total",{"$f":"SUM(B205+B200+B195+B190+B185+B180+B175+B170+B165+B160+B155+B150)","v":2524},494,53,0,125,181,142,3519,null,{"$f":"SUM(K205+K200+K195+K190+K185+K180+K175+K170+K165+K160+K155+K150)","v":131},19,2,0,1,31,140,324,null,{"$f":"SUM(T205+T200+T195+T190+T185+T180+T175+T170+T165+T160+T155+T150)","v":14},2,0,0,0,1,0,17,null,{"$f":"SUM(AC205+AC200+AC195+AC190+AC185+AC180+AC175+AC170+AC165+AC160+AC155+AC150)","v":3860}]
[]
["ORIGIN SUMMARY"]
[null,"Origin :",null,"Arm A","A409 South Parade (E)",null,null,null,"Total",null,"Origin :",null,"Arm B","Fisher's Lane",null,null,null,"Total",null,"Origin :",null,"Arm C","A409 South Parade (W)",null,null,null,"Total",null,"Origin Totals"]
[null,{"$f":"$B$10","v":"Car"},{"$f":"$C$10","v":"LGV"},{"$f":"$D$10","v":"OGV1"},{"$f":"$E$10","v":"OGV2"},{"$f":"$F$10","v":"PSV"},{"$f":"$G$10","v":"MC"},{"$f":"$H$10","v":"PC"},null,null,{"$f":"$B$10","v":"Car"},{"$f":"$C$10","v":"LGV"},{"$f":"$D$10","v":"OGV1"},{"$f":"$E$10","v":"OGV2"},{"$f":"$F$10","v":"PSV"},{"$f":"$G$10","v":"MC"},{"$f":"$H$10","v":"PC"},null,null,{"$f":"$B$10","v":"Car"},{"$f":"$C$10","v":"LGV"},{"$f":"$D$10","v":"OGV1"},{"$f":"$E$10","v":"OGV2"},{"$f":"$F$10","v":"PSV"},{"$f":"$G$10","v":"MC"},{"$f":"$H$10","v":"PC"}]
[]
["07:00:00",{"$f":"SUM(B12+K12+T12)","v":26},5,0,0,4,0,4,{"$f":"SUM(B213:H213)","v":39},null,{"$f":"SUM(B79+K79+T79)","v":2},0,0,0,1,0,0,{"$f":"SUM(K213:Q213)","v":3},null,{"$f":"SUM(B146+K146+T146)","v":46},14,0,0,3,0,3,{"$f":"SUM(T213:Z213)","v":66},null,{"$f":"SUM(I213+R213+AA213)","v":108}]
["07:15:00",{"$f":"SUM(B13+K13+T13)","v":39},6,0,0,5,0,7,{"$f":"SUM(B214:H214)","v":57},null,{"$f":"SUM(B80+K80+T80)","v":1},1,0,0,1,1,2,{"$f":"SUM(K214:Q214)","v":6},null,{"$f":"SUM(B147+K147+T147)","v":42},15,1,0,4,3.0000000000000004,13,{"$f":"SUM(T214:Z214)","v":78},null,{"$f":"SUM(I214+R214+AA214)","v":141}]
["07:30:00",{"$f":"SUM(B14+K14+T14)","v":33},5,0,0,6,0,6.0000000000000009,{"$f":"SUM(B215:H215)","v":50},null,{"$f":"SUM(B81+K81+T81)","v":4},0,0,0,1,1,5,{"$f":"SUM(K215:Q215)","v":11},null,{"$f":"SUM(B148+K148+T148)","v":59},30,2,0,3,6.0000000000000009,10,{"$f":"SUM(T215:Z215)","v":110},null,{"$f":"SUM(I215+R215+AA215)","v":171}]
["07:45:00",{"$f":"SUM(B15+K15+T15)","v":36},12,1,0,3,2,1,{"$f":"SUM(B216:H216)","v":55},null,{"$f":"SUM(B82+K82+T82)","v":2},1,0,0,1,0,3,{"$f":"SUM(K216:Q216)","v":7},null,{"$f":"SUM(B149+K149+T149)","v":68},25,4,0,3,3.0000000000000004,5,{"$f":"SUM(T216:Z216)","v":108},null,{"$f":"SUM(I216+R216+AA216)","v":170}]
["1 Hr",{"$f":"SUM(B213:B216)","v":134},28,1,0,18,2,18,201,null,{"$f":"SUM(K213:K216)","v":9},2,0,0,4,2,10,27,null,{"$f":"SUM(T213:T216)","v":215},84,7,0,13,12.000000000000002,31,362,null,{"$f":"SUM(AC213:AC216)","v":590}]
["08:00:00",{"$f":"SUM(B17+K17+T17)","v":44},6,1,0,5,0,1,{"$f":"SUM(B218:H218)","v":57},null,{"$f":"SUM(B84+K84+T84)","v":1},0,0,0,1,1,3,{"$f":"SUM(K218:Q218)","v":6},null,{"$f":"SUM(B151+K151+T151)","v":71},14,2,0,4,4,15,{"$f":"SUM(T218:Z218)","v":110},null,{"$f":"SUM(I218+R218+AA218)","v":173}]
["08:15:00",{"$f":"SUM(B18+K18+T18)","v":52},7,0,0,3,0,3.0000000000000004,{"$f":"SUM(B219:H219)","v":65},null,{"$f":"SUM(B85+K85+T85)","v":2},0,0,0,1,1,4,{"$f":"SUM(K219:Q219)","v":8},null,{"$f":"SUM(B152+K152+T152)","v":71},16,1,0,2,6.0000000000000009,13,{"$f":"SUM(T219:Z219)","v":109},null,{"$f":"SUM(I219+R219+AA219)","v":182}]
["08:30:00",{"$f":"SUM(B19+K19+T19)","v":54},13,2,0,5,2,2,{"$f":"SUM(B220:H220)","v":78},null,{"$f":"SUM(B86+K86+T86)","v":3},1,0,0,1,0,3,{"$f":"SUM(K220:Q220)","v":8},null,{"$f":"SUM(B153+K153+T153)","v":84},13,3,0,3,2,12.000000000000002,{"$f":"SUM(T220:Z220)","v":117},null,{"$f":"SUM(I220+R220+AA220)","v":203}]
["08:45:00",{"$f":"SUM(B20+K20+T20)","v":65},12,0,0,3,4,6,{"$f":"SUM(B221:H221)","v":90},null,{"$f":"SUM(B87+K87+T87)","v":5},3,0,0,1,1,6,{"$f":"SUM(K221:Q221)","v":16},null,{"$f":"SUM(B154+K154+T154)","v":65},14,4,0,2,4,7,{"$f":"SUM(T221:Z221)","v":96},null,{"$f":"SUM(I221+R221+AA221)","v":202}]
["1 Hr",{"$f":"SUM(B218:B221)","v":215},38,3,0,16,6,12,290,null,{"$f":"SUM(K218:K221)","v":11},4,0,0,4,3,16,38,null,{"$f":"SUM(T218:T221)","v":291},57,10,0,11,16,47,432,null,{"$f":"SUM(AC218:AC221)","v":760}]
["09:00:00",{"$f":"SUM(B22+K22+T22)","v":65},12,2,0,4,3.0000000000000004,5,{"$f":"SUM(B223:H223)","v":91},null,{"$f":"SUM(B89+K89+T89)","v":7},1,0,0,0,0,5,{"$f":"SUM(K223:Q223)","v":13},null,{"$f":"SUM(B156+K156+T156)","v":61},13,5,0,4,2,3,{"$f":"SUM(T223:Z223)","v":88},null,{"$f":"SUM(I223+R223+AA223)","v":192}]
["09:15:00",{"$f":"SUM(B23+K23+T23)","v":60},15,1,0,3,4,3,{"$f":"SUM(B224:H224)","v":86},null,{"$f":"SUM(B90+K90+T90)","v":5},2,0,0,1,0,6,{"$f":"SUM(K224:Q224)","v":14},null,{"$f":"SUM(B157+K157+T157)","v":62},13,1,0,2,1,8,{"$f":"SUM(T224:Z224)","v":87},null,{"$f":"SUM(I224+R224+AA224)","v":187}]
["09:30:00",{"$f":"SUM(B24+K24+T24)","v":46},10,0,0,4,2,3.0000000000000004,{"$f":"SUM(B225:H225)","v":65},null,{"$f":"SUM(B91+K91+T91)","v":7},1,0,0,1,0,0,{"$f":"SUM(K225:Q225)","v":9},null,{"$f":"SUM(B158+K158+T158)","v":51},26,1,0,3,5,9,{"$f":"SUM(T225:Z225)","v":95},null,{"$f":"SUM(I225+R225+AA225)","v":169}]
["09:45:00",{"$f":"SUM(B25+K25+T25)","v":55},7,1,0,4,3.0000000000000004,3,{"$f":"SUM(B226:H226)","v":73},null,{"$f":"SUM(B92+K92+T92)","v":2},1,0,0,1,1,4,{"$f":"SUM(K226:Q226)","v":9},null,{"$f":"SUM(B159+K159+T159)","v":64},22,1,0,2,1,5,{"$f":"SUM(T226:Z226)","v":95},null,{"$f":"SUM(I226+R226+AA226)","v":177}]
["1 Hr",{"$f":"SUM(B223:B226)","v":226},44,4,0,15,12,14,315,null,{"$f":"SUM(K223:K226)","v":21},5,0,0,3,1,15,45,null,{"$f":"SUM(T223:T226)","v":238},74,8,0,11,9,25,365,null,{"$f":"SUM(AC223:AC226)","v":725}]
["10:00:00",{"$f":"SUM(B27+K27+T27)","v":35},6,1,0,4,2,3,{"$f":"SUM(B228:H228)","v":51},null,{"$f":"SUM(B94+K94+T94)","v":4},1,0,0,1,0,2,{"$f":"SUM(K228:Q228)","v":8},null,{"$f":"SUM(B161+K161+T161)","v":65},21,0,0,2,3,3,{"$f":"SUM(T228:Z228)","v":94},null,{"$f":"SUM(I228+R228+AA228)","v":153}]
["10:15:00",{"$f":"SUM(B28+K28+T28)","v":49},8,1,0,1,2,2,{"$f":"SUM(B229:H229)","v":63},null,{"$f":"SUM(B95+K95+T95)","v":1},2,0,0,1,0,2,{"$f":"SUM(K229:Q229)","v":6},null,{"$f":"SUM(B162+K162+T162)","v":49},8,3,0,3,4,5,{"$f":"SUM(T229:Z229)","v":72},null,{"$f":"SUM(I229+R229+AA229)","v":141}]
["10:30:00",{"$f":"SUM(B29+K29+T29)","v":60},13,2,0,5,1,0,{"$f":"SUM(B230:H230)","v":81},null,{"$f":"SUM(B96+K96+T96)","v":4},2,0,0,1,1,3,{"$f":"SUM(K230:Q230)","v":11},null,{"$f":"SUM(B163+K163+T163)","v":50},17,1,0,3,1,4,{"$f":"SUM(T230:Z230)","v":76},null,{"$f":"SUM(I230+R230+AA230)","v":168}]
["10:45:00",{"$f":"SUM(B30+K30+T30)","v":56},15,1,0,2,2,3,{"$f":"SUM(B231:H231)","v":79},null,{"$f":"SUM(B97+K97+T97)","v":6},3,0,0,1,0,2,{"$f":"SUM(K231:Q231)","v":12},null,{"$f":"SUM(B164+K164+T164)","v":62},5,2,0,2,4,2,{"$f":"SUM(T231:Z231)","v":77},null,{"$f":"SUM(I231+R231+AA231)","v":168}]
["1 Hr",{"$f":"SUM(B228:B231)","v":200},42,5,0,12,7,8,274,null,{"$f":"SUM(K228:K231)","v":15},8,0,0,4,1,9,37,null,{"$f":"SUM(T228:T231)","v":226},51,6,0,10,12,14,319,null,{"$f":"SUM(AC228:AC231)","v":630}]
["11:00:00",{"$f":"SUM(B32+K32+T32)","v":43},18,0,0,4,7,2,{"$f":"SUM(B233:H233)","v":74},null,{"$f":"SUM(B99+K99+T99)","v":7},2,0,0,1,0,3,{"$f":"SUM(K233:Q233)","v":13},null,{"$f":"SUM(B166+K166+T166)","v":60},12,0,0,3,4,1,{"$f":"SUM(T233:Z233)","v":80},null,{"$f":"SUM(I233+R233+AA233)","v":167}]
["11:15:00",{"$f":"SUM(B33+K33+T33)","v":38},10,0,0,3,2,0,{"$f":"SUM(B234:H234)","v":53},null,{"$f":"SUM(B100+K100+T100)","v":3},0,0,0,1,3,5,{"$f":"SUM(K234:Q234)","v":12},null,{"$f":"SUM(B167+K167+T167)","v":53},16,0,0,2,5,6.0000000000000009,{"$f":"SUM(T234:Z234)","v":82},null,{"$f":"SUM(I234+R234+AA234)","v":147}]
["11:30:00",{"$f":"SUM(B34+K34+T34)","v":46},12,1,0,4,5,3,{"$f":"SUM(B235:H235)","v":71},null,{"$f":"SUM(B101+K101+T101)","v":5},1,0,0,0,0,2,{"$f":"SUM(K235:Q235)","v":8},null,{"$f":"SUM(B168+K168+T168)","v":52},23,0,0,2,5,4,{"$f":"SUM(T235:Z235)","v":86},null,{"$f":"SUM(I235+R235+AA235)","v":165}]
["11:45:00",{"$f":"SUM(B35+K35+T35)","v":60},15,1,0,4,6.0000000000000009,2,{"$f":"SUM(B236:H236)","v":88},null,{"$f":"SUM(B102+K102+T102)","v":10},0,0,0,1,1,5,{"$f":"SUM(K236:Q236)","v":17},null,{"$f":"SUM(B169+K169+T169)","v":53},11,3,0,2,7,2,{"$f":"SUM(T236:Z236)","v":78},null,{"$f":"SUM(I236+R236+AA236)","v":183}]
["1 Hr",{"$f":"SUM(B233:B236)","v":187},55,2,0,15,20,7,286,null,{"$f":"SUM(K233:K236)","v":25},3,0,0,3,4,15,50,null,{"$f":"SUM(T233:T236)","v":218},62,3,0,9,21,13,326,null,{"$f":"SUM(AC233:AC236)","v":662}]
["12:00:00",{"$f":"SUM(B37+K37+T37)","v":53},11,2,0,1,1,1,{"$f":"SUM(B238:H238)","v":69},null,{"$f":"SUM(B104+K104+T104)","v":6},1,0,0,1,2,3.0000000000000004,{"$f":"SUM(K238:Q238)","v":13},null,{"$f":"SUM(B171+K171+T171)","v":48},17,2,0,3,1,4,{"$f":"SUM(T238:Z238)","v":75},null,{"$f":"SUM(I238+R238+AA238)","v":157}]
["12:15:00",{"$f":"SUM(B38+K38+T38)","v":55},14,0,0,4,6,0,{"$f":"SUM(B239:H239)","v":79},null,{"$f":"SUM(B105+K105+T105)","v":3},2,0,0,1,1,1,{"$f":"SUM(K239:Q239)","v":8},null,{"$f":"SUM(B172+K172+T172)","v":55},10,1,0,2,2,6.0000000000000009,{"$f":"SUM(T239:Z239)","v":76},null,{"$f":"SUM(I239+R239+AA239)","v":163}]
["12:30:00",{"$f":"SUM(B39+K39+T39)","v":55},14,3,0,3,4,3,{"$f":"SUM(B240:H240)","v":82},null,{"$f":"SUM(B106+K106+T106)","v":6},1,0,0,1,2,0,{"$f":"SUM(K240:Q240)","v":10},null,{"$f":"SUM(B173+K173+T173)","v":53},7,2,0,2,5,2,{"$f":"SUM(T240:Z240)","v":71},null,{"$f":"SUM(I240+R240+AA240)","v":163}]
["12:45:00",{"$f":"SUM(B40+K40+T40)","v":61},15,1,0,5,1,4,{"$f":"SUM(B241:H241)","v":87},null,{"$f":"SUM(B107+K107+T107)","v":6},1,0,0,1,0,6,{"$f":"SUM(K241:Q241)","v":14},null,{"$f":"SUM(B174+K174+T174)","v":58},11,0,0,3,5,2,{"$f":"SUM(T241:Z241)","v":79},null,{"$f":"SUM(I241+R241+AA241)","v":180}]
["1 Hr",{"$f":"SUM(B238:B241)","v":224},54,6,0,13,12,8,317,null,{"$f":"SUM(K238:K241)","v":21},5,0,0,4,5,10,45,null,{"$f":"SUM(T238:T241)","v":214},45,5,0,10,13,14,301,null,{"$f":"SUM(AC238:AC241)","v":663}]
["13:00:00",{"$f":"SUM(B42+K42+T42)","v":65},10,2,0,4,7,0,{"$f":"SUM(B243:H243)","v":88},null,{"$f":"SUM(B109+K109+T109)","v":8},0,0,0,1,0,5,{"$f":"SUM(K243:Q243)","v":14},null,{"$f":"SUM(B176+K176+T176)","v":59},12,1,0,3,3,5,{"$f":"SUM(T243:Z243)","v":83},null,{"$f":"SUM(I243+R243+AA243)","v":185}]
["13:15:00",{"$f":"SUM(B43+K43+T43)","v":59},17,2,0,4,6.0000000000000009,3,{"$f":"SUM(B244:H244)","v":91},null,{"$f":"SUM(B110+K110+T110)","v":6},1,0,0,0,2,3,{"$f":"SUM(K244:Q244)","v":12},null,{"$f":"SUM(B177+K177+T177)","v":48},8,1,0,3,10,3,{"$f":"SUM(T244:Z244)","v":73},null,{"$f":"SUM(I244+R244+AA244)","v":176}]
["13:30:00",{"$f":"SUM(B44+K44+T44)","v":61},10,3,0,3,5,5,{"$f":"SUM(B245:H245)","v":87},null,{"$f":"SUM(B111+K111+T111)","v":7},0,0,0,2,0,3,{"$f":"SUM(K245:Q245)","v":12},null,{"$f":"SUM(B178+K178+T178)","v":42},5,1,0,2,4,0,{"$f":"SUM(T245:Z245)","v":54},null,{"$f":"SUM(I245+R245+AA245)","v":153}]
["13:45:00",{"$f":"SUM(B45+K45+T45)","v":54},15,2,1,3,6,4,{"$f":"SUM(B246:H246)","v":85},null,{"$f":"SUM(B112+K112+T112)","v":1},0,0,0,0,1,3,{"$f":"SUM(K246:Q246)","v":5},null,{"$f":"SUM(B179+K179+T179)","v":44},11,0,0,3,3.0000000000000004,7,{"$f":"SUM(T246:Z246)","v":68},null,{"$f":"SUM(I246+R246+AA246)","v":158}]
["1 Hr",{"$f":"SUM(B243:B246)","v":239},52,9,1,14,24,12,351,null,{"$f":"SUM(K243:K246)","v":22},1,0,0,3,3,14,43,null,{"$f":"SUM(T243:T246)","v":193},36,3,0,11,20,15,278,null,{"$f":"SUM(AC243:AC246)","v":672}]
["14:00:00",{"$f":"SUM(B47+K47+T47)","v":51},13,0,0,5,10,2,{"$f":"SUM(B248:H248)","v":81},null,{"$f":"SUM(B114+K114+T114)","v":6},0,0,0,1,2,2,{"$f":"SUM(K248:Q248)","v":11},null,{"$f":"SUM(B181+K181+T181)","v":39},7,2,0,3,2,4,{"$f":"SUM(T248:Z248)","v":57},null,{"$f":"SUM(I248+R248+AA248)","v":149}]
["14:15:00",{"$f":"SUM(B48+K48+T48)","v":84},9,1,0,5,4,4,{"$f":"SUM(B249:H249)","v":107},null,{"$f":"SUM(B115+K115+T115)","v":11},0,0,0,1,2,4,{"$f":"SUM(K249:Q249)","v":18},null,{"$f":"SUM(B182+K182+T182)","v":57},8,1,0,2,8,1,{"$f":"SUM(T249:Z249)","v":77},null,{"$f":"SUM(I249+R249+AA249)","v":202}]
["14:30:00",{"$f":"SUM(B49+K49+T49)","v":52},14,0,0,2,8,1,{"$f":"SUM(B250:H250)","v":77},null,{"$f":"SUM(B116+K116+T116)","v":4},0,0,0,1,0,8,{"$f":"SUM(K250:Q250)","v":13},null,{"$f":"SUM(B183+K183+T183)","v":48},5,1,0,4,11,5,{"$f":"SUM(T250:Z250)","v":74},null,{"$f":"SUM(I250+R250+AA250)","v":164}]
["14:45:00",{"$f":"SUM(B50+K50+T50)","v":61},9,1,1,4,6.0000000000000009,1,{"$f":"SUM(B251:H251)","v":83},null,{"$f":"SUM(B117+K117+T117)","v":4},0,0,0,1,1,6.0000000000000009,{"$f":"SUM(K251:Q251)","v":12},null,{"$f":"SUM(B184+K184+T184)","v":53},9,2,0,3,4,11,{"$f":"SUM(T251:Z251)","v":82},null,{"$f":"SUM(I251+R251+AA251)","v":177}]
["1 Hr",{"$f":"SUM(B248:B251)","v":248},45,2,1,16,28,8,348,null,{"$f":"SUM(K248:K251)","v":25},0,0,0,4,5,20,54,null,{"$f":"SUM(T248:T251)","v":197},29,6,0,12,25,21,290,null,{"$f":"SUM(AC248:AC251)","v":692}]
["15:00:00",{"$f":"SUM(B52+K52+T52)","v":69},19,3,0,4,8,1,{"$f":"SUM(B253:H253)","v":104},null,{"$f":"SUM(B119+K119+T119)","v":11},0,0,0,1,1,2,{"$f":"SUM(K253:Q253)","v":15},null,{"$f":"SUM(B186+K186+T186)","v":64},5,0,0,2,7,6,{"$f":"SUM(T253:Z253)","v":84},null,{"$f":"SUM(I253+R253+AA253)","v":203}]
["15:15:00",{"$f":"SUM(B53+K53+T53)","v":77},17,2,0,3,4,2,{"$f":"SUM(B254:H254)","v":105},null,{"$f":"SUM(B120+K120+T120)","v":6},0,0,0,2,1,5,{"$f":"SUM(K254:Q254)","v":14},null,{"$f":"SUM(B187+K187+T187)","v":56},8,2,0,2,5,4,{"$f":"SUM(T254:Z254)","v":77},null,{"$f":"SUM(I254+R254+AA254)","v":196}]
["15:30:00",{"$f":"SUM(B54+K54+T54)","v":57},12,2,0,3,4,8,{"$f":"SUM(B255:H255)","v":86},null,{"$f":"SUM(B121+K121+T121)","v":4},1,0,0,1,0,2,{"$f":"SUM(K255:Q255)","v":8},null,{"$f":"SUM(B188+K188+T188)","v":52},6,0,0,3,4,5,{"$f":"SUM(T255:Z255)","v":70},null,{"$f":"SUM(I255+R255+AA255)","v":164}]
["15:45:00",{"$f":"SUM(B55+K55+T55)","v":81},15,1,0,2,8,2,{"$f":"SUM(B256:H256)","v":109},null,{"$f":"SUM(B122+K122+T122)","v":5},0,0,0,0,1,4,{"$f":"SUM(K256:Q256)","v":10},null,{"$f":"SUM(B189+K189+T189)","v":46},5,0,0,3,1,5,{"$f":"SUM(T256:Z256)","v":60},null,{"$f":"SUM(I256+R256+AA256)","v":179}]
["1 Hr",{"$f":"SUM(B253:B256)","v":284},63,8,0,12,24,13,404,null,{"$f":"SUM(K253:K256)","v":26},1,0,0,4,3,13,47,null,{"$f":"SUM(T253:T256)","v":218},24,2,0,10,17,20,291,null,{"$f":"SUM(AC253:AC256)","v":742}]
["16:00:00",{"$f":"SUM(B57+K57+T57)","v":82},16,0,0,3,3,5,{"$f":"SUM(B258:H258)","v":109},null,{"$f":"SUM(B124+K124+T124)","v":1},1,0,0,1,0,1,{"$f":"SUM(K258:Q258)","v":4},null,{"$f":"SUM(B191+K191+T191)","v":51},9,2,0,2,4,9,{"$f":"SUM(T258:Z258)","v":77},null,{"$f":"SUM(I258+R258+AA258)","v":190}]
["16:15:00",{"$f":"SUM(B58+K58+T58)","v":68},14,5,0,6,3,5,{"$f":"SUM(B259:H259)","v":101},null,{"$f":"SUM(B125+K125+T125)","v":4},0,0,0,1,2,11,{"$f":"SUM(K259:Q259)","v":18},null,{"$f":"SUM(B192+K192+T192)","v":52},7,1,0,3,1,5,{"$f":"SUM(T259:Z259)","v":69},null,{"$f":"SUM(I259+R259+AA259)","v":188}]
["16:30:00",{"$f":"SUM(B59+K59+T59)","v":58},13,0,0,3,2,10,{"$f":"SUM(B260:H260)","v":86},null,{"$f":"SUM(B126+K126+T126)","v":4},2,0,0,1,3,9,{"$f":"SUM(K260:Q260)","v":19},null,{"$f":"SUM(B193+K193+T193)","v":55},5,0,0,2,5,5,{"$f":"SUM(T260:Z260)","v":72},null,{"$f":"SUM(I260+R260+AA260)","v":177}]
["16:45:00",{"$f":"SUM(B60+K60+T60)","v":68},13,1,0,2,8,7.0000000000000009,{"$f":"SUM(B261:H261)","v":99},null,{"$f":"SUM(B127+K127+T127)","v":6},1,0,0,1,2,7,{"$f":"SUM(K261:Q261)","v":17},null,{"$f":"SUM(B194+K194+T194)","v":52},4,1,0,3,5,8,{"$f":"SUM(T261:Z261)","v":73},null,{"$f":"SUM(I261+R261+AA261)","v":189}]
["1 Hr",{"$f":"SUM(B258:B261)","v":276},56,6,0,14,16,27,395,null,{"$f":"SUM(K258:K261)","v":15},4,0,0,4,7,28,58,null,{"$f":"SUM(T258:T261)","v":210},25,4,0,10,15,27,291,null,{"$f":"SUM(AC258:AC261)","v":744}]
["17:00:00",{"$f":"SUM(B62+K62+T62)","v":79},16,0,0,5,4,10,{"$f":"SUM(B263:H263)","v":114},null,{"$f":"SUM(B129+K129+T129)","v":5},0,0,0,1,1,9,{"$f":"SUM(K263:Q263)","v":16},null,{"$f":"SUM(B196+K196+T196)","v":68},6,0,0,2,2,7,{"$f":"SUM(T263:Z263)","v":85},null,{"$f":"SUM(I263+R263+AA263)","v":215}]
["17:15:00",{"$f":"SUM(B63+K63+T63)","v":67},9,1,0,3,10,6,{"$f":"SUM(B264:H264)","v":96},null,{"$f":"SUM(B130+K130+T130)","v":5},2,0,0,1,0,3.0000000000000004,{"$f":"SUM(K264:Q264)","v":11},null,{"$f":"SUM(B197+K197+T197)","v":60},4,1,0,3,6.0000000000000009,4,{"$f":"SUM(T264:Z264)","v":78},null,{"$f":"SUM(I264+R264+AA264)","v":185}]
["17:30:00",{"$f":"SUM(B64+K64+T64)","v":84},9,1,0,3,7.0000000000000009,4,{"$f":"SUM(B265:H265)","v":108},null,{"$f":"SUM(B131+K131+T131)","v":9},0,0,0,0,2,8,{"$f":"SUM(K265:Q265)","v":19},null,{"$f":"SUM(B198+K198+T198)","v":45},3,0,0,2,6,10,{"$f":"SUM(T265:Z265)","v":66},null,{"$f":"SUM(I265+R265+AA265)","v":193}]
["17:45:00",{"$f":"SUM(B65+K65+T65)","v":81},5,1,0,4,5,11,{"$f":"SUM(B266:H266)","v":107},null,{"$f":"SUM(B132+K132+T132)","v":4},0,0,0,2,0,6,{"$f":"SUM(K266:Q266)","v":12},null,{"$f":"SUM(B199+K199+T199)","v":67},4,0,0,3,3,10,{"$f":"SUM(T266:Z266)","v":87},null,{"$f":"SUM(I266+R266+AA266)","v":206}]
["1 Hr",{"$f":"SUM(B263:B266)","v":311},39,3,0,15,26,31,425,null,{"$f":"SUM(K263:K266)","v":23},2,0,0,4,3,26,58,null,{"$f":"SUM(T263:T266)","v":240},17,1,0,10,17,31,316,null,{"$f":"SUM(AC263:AC266)","v":799}]
["18:00:00",{"$f":"SUM(B67+K67+T67)","v":84},7,1,0,3,6,5,{"$f":"SUM(B268:H268)","v":106},null,{"$f":"SUM(B134+K134+T134)","v":4},0,0,0,0,1,2,{"$f":"SUM(K268:Q268)","v":7},null,{"$f":"SUM(B201+K201+T201)","v":43},1,0,0,2,5,9,{"$f":"SUM(T268:Z268)","v":60},null,{"$f":"SUM(I268+R268+AA268)","v":173}]
["18:15:00",{"$f":"SUM(B68+K68+T68)","v":73},7,0,0,3,3.0000000000000004,3,{"$f":"SUM(B269:H269)","v":89},null,{"$f":"SUM(B135+K135+T135)","v":2},0,0,0,1,2,6,{"$f":"SUM(K269:Q269)","v":11},null,{"$f":"SUM(B202+K202+T202)","v":63},1,0,0,2,5,4,{"$f":"SUM(T269:Z269)","v":75},null,{"$f":"SUM(I269+R269+AA269)","v":175}]
["18:30:00",{"$f":"SUM(B69+K69+T69)","v":77},8,1,0,3,6,11,{"$f":"SUM(B270:H270)","v":106},null,{"$f":"SUM(B136+K136+T136)","v":4},0,0,0,1,0,5,{"$f":"SUM(K270:Q270)","v":10},null,{"$f":"SUM(B203+K203+T203)","v":53},3,0,0,2,12,6,{"$f":"SUM(T270:Z270)","v":76},null,{"$f":"SUM(I270+R270+AA270)","v":192}]
["18:45:00",{"$f":"SUM(B70+K70+T70)","v":74},3,0,0,2,13.000000000000002,6.0000000000000009,{"$f":"SUM(B271:H271)","v":98},null,{"$f":"SUM(B137+K137+T137)","v":6},0,0,0,1,3,2,{"$f":"SUM(K271:Q271)","v":12},null,{"$f":"SUM(B204+K204+T204)","v":50},6,0,0,3,14.000000000000002,5,{"$f":"SUM(T271:Z271)","v":78},null,{"$f":"SUM(I271+R271+AA271)","v":188}]
["1 Hr",{"$f":"SUM(B268:B271)","v":308},25,2,0,11,28,25,399,null,{"$f":"SUM(K268:K271)","v":16},0,0,0,3,6,15,40,null,{"$f":"SUM(T268:T271)","v":209},11,0,0,9,36,24,289,null,{"$f":"SUM(AC268:AC271)","v":728}]
[]
["Total",{"$f":"SUM(B272+B267+B262+B257+B252+B247+B242+B237+B232+B227+B222+B217)","v":2852},541,51,2,171,205,183,4005,null,{"$f":"SUM(K272+K267+K262+K257+K252+K247+K242+K237+K232+K227+K222+K217)","v":229},35,0,0,44,43,191,542,null,{"$f":"SUM(T272+T267+T262+T257+T252+T247+T242+T237+T232+T227+T222+T217)","v":2669},515,55,0,126,213,282,3860,null,{"$f":"SUM(AC272+AC267+AC262+AC257+AC252+AC247+AC242+AC237+AC232+AC227+AC222+AC217)","v":8407}]
[]
["DESTINATION SUMMARY"]
[null,"Destination :",null,"Arm A","A409 South Parade (E)",null,null,null,"Total",null,"Destination :",null,"Arm B","Fisher's Lane",null,null,null,"Total",null,"Destination :",null,"Arm C","A409 South Parade (W)",null,null,null,"Total",null,"Dest Totals"]
[null,{"$f":"$B$10","v":"Car"},{"$f":"$C$10","v":"LGV"},{"$f":"$D$10","v":"OGV1"},{"$f":"$E$10","v":"OGV2"},{"$f":"$F$10","v":"PSV"},{"$f":"$G$10","v":"MC"},{"$f":"$H$10","v":"PC"},null,null,{"$f":"$B$10","v":"Car"},{"$f":"$C$10","v":"LGV"},{"$f":"$D$10","v":"OGV1"},{"$f":"$E$10","v":"OGV2"},{"$f":"$F$10","v":"PSV"},{"$f":"$G$10","v":"MC"},{"$f":"$H$10","v":"PC"},null,null,{"$f":"$B$10","v":"Car"},{"$f":"$C$10","v":"LGV"},{"$f":"$D$10","v":"OGV1"},{"$f":"$E$10","v":"OGV2"},{"$f":"$F$10","v":"PSV"},{"$f":"$G$10","v":"MC"},{"$f":"$H$10","v":"PC"}]
[]
["07:00:00",{"$f":"SUM(B12+B79+B146)","v":46},13,0,0,4,0,2,{"$f":"SUM(B280:H280)","v":65},null,{"$f":"SUM(K12+K79+K146)","v":2},1,0,0,0,0,3,{"$f":"SUM(K280:Q280)","v":6},null,{"$f":"SUM(T12+T79+T146)","v":26},5,0,0,4,0,2,{"$f":"SUM(T280:Z280)","v":37},null,{"$f":"SUM(I280+R280+AA280)","v":108}]
["07:15:00",{"$f":"SUM(B13+B80+B147)","v":40},15,1,0,5,3.0000000000000004,10,{"$f":"SUM(B281:H281)","v":74},null,{"$f":"SUM(K13+K80+K147)","v":3},1,0,0,2,0,8,{"$f":"SUM(K281:Q281)","v":14},null,{"$f":"SUM(T13+T80+T147)","v":39},6,0,0,3,1,4,{"$f":"SUM(T281:Z281)","v":53},null,{"$f":"SUM(I281+R281+AA281)","v":141}]
["07:30:00",{"$f":"SUM(B14+B81+B148)","v":56},30,2,0,4,7.0000000000000009,6,{"$f":"SUM(B282:H282)","v":105},null,{"$f":"SUM(K14+K81+K148)","v":3},0,0,0,1,0,8,{"$f":"SUM(K282:Q282)","v":12},null,{"$f":"SUM(T14+T81+T148)","v":37},5,0,0,5,0,7,{"$f":"SUM(T282:Z282)","v":54},null,{"$f":"SUM(I282+R282+AA282)","v":171}]
["07:45:00",{"$f":"SUM(B15+B82+B149)","v":68},26,4,0,4,3.0000000000000004,4,{"$f":"SUM(B283:H283)","v":109},null,{"$f":"SUM(K15+K82+K149)","v":5},1,0,0,0,0,2,{"$f":"SUM(K283:Q283)","v":8},null,{"$f":"SUM(T15+T82+T149)","v":33},11,1,0,3,2,3,{"$f":"SUM(T283:Z283)","v":53},null,{"$f":"SUM(I283+R283+AA283)","v":170}]
["1 Hr",{"$f":"SUM(B280:B283)","v":210},84,7,0,17,13.000000000000002,22,353,null,{"$f":"SUM(K280:K283)","v":13},3,0,0,3,0,21,40,null,{"$f":"SUM(T280:T283)","v":135},27,1,0,15,3,16,197,null,{"$f":"SUM(AC280:AC283)","v":590}]
["08:00:00",{"$f":"SUM(B17+B84+B151)","v":70},13,2,0,4,4,10,{"$f":"SUM(B285:H285)","v":103},null,{"$f":"SUM(K17+K84+K151)","v":5},1,0,0,3,0,7.0000000000000009,{"$f":"SUM(K285:Q285)","v":16},null,{"$f":"SUM(T17+T84+T151)","v":41},6,1,0,3,1,2,{"$f":"SUM(T285:Z285)","v":54},null,{"$f":"SUM(I285+R285+AA285)","v":173}]
["08:15:00",{"$f":"SUM(B18+B85+B152)","v":70},16,1,0,3,6.0000000000000009,9,{"$f":"SUM(B286:H286)","v":105},null,{"$f":"SUM(K18+K85+K152)","v":6},0,0,0,1,0,7,{"$f":"SUM(K286:Q286)","v":14},null,{"$f":"SUM(T18+T85+T152)","v":49},7,0,0,2,1,4,{"$f":"SUM(T286:Z286)","v":63},null,{"$f":"SUM(I286+R286+AA286)","v":182}]
["08:30:00",{"$f":"SUM(B19+B86+B153)","v":80},13,3,0,4,1,7.0000000000000009,{"$f":"SUM(B287:H287)","v":108},null,{"$f":"SUM(K19+K86+K153)","v":6},1,0,0,1,1,6.0000000000000009,{"$f":"SUM(K287:Q287)","v":15},null,{"$f":"SUM(T19+T86+T153)","v":55},13,2,0,4,2,4,{"$f":"SUM(T287:Z287)","v":80},null,{"$f":"SUM(I287+R287+AA287)","v":203}]
["08:45:00",{"$f":"SUM(B20+B87+B154)","v":66},17,4,0,3,5,6,{"$f":"SUM(B288:H288)","v":101},null,{"$f":"SUM(K20+K87+K154)","v":3},0,0,0,1,0,5,{"$f":"SUM(K288:Q288)","v":9},null,{"$f":"SUM(T20+T87+T154)","v":66},12,0,0,2,4,8,{"$f":"SUM(T288:Z288)","v":92},null,{"$f":"SUM(I288+R288+AA288)","v":202}]
["1 Hr",{"$f":"SUM(B285:B288)","v":286},59,10,0,14,16,32,417,null,{"$f":"SUM(K285:K288)","v":20},2,0,0,6,1,25,54,null,{"$f":"SUM(T285:T288)","v":211},38,3,0,11,8,18,289,null,{"$f":"SUM(AC285:AC288)","v":760}]
["09:00:00",{"$f":"SUM(B22+B89+B156)","v":66},13,5,0,4,2,3,{"$f":"SUM(B290:H290)","v":93},null,{"$f":"SUM(K22+K89+K156)","v":4},2,0,0,1,0,2,{"$f":"SUM(K290:Q290)","v":9},null,{"$f":"SUM(T22+T89+T156)","v":63},11,2,0,3,3.0000000000000004,8,{"$f":"SUM(T290:Z290)","v":90},null,{"$f":"SUM(I290+R290+AA290)","v":192}]
["09:15:00",{"$f":"SUM(B23+B90+B157)","v":62},15,1,0,3,1,9,{"$f":"SUM(B291:H291)","v":91},null,{"$f":"SUM(K23+K90+K157)","v":3},2,0,0,1,0,6,{"$f":"SUM(K291:Q291)","v":12},null,{"$f":"SUM(T23+T90+T157)","v":62},13,1,0,2,4,2,{"$f":"SUM(T291:Z291)","v":84},null,{"$f":"SUM(I291+R291+AA291)","v":187}]
["09:30:00",{"$f":"SUM(B24+B91+B158)","v":55},25,1,0,4,4,4,{"$f":"SUM(B292:H292)","v":93},null,{"$f":"SUM(K24+K91+K158)","v":0},1,0,0,1,1,5,{"$f":"SUM(K292:Q292)","v":8},null,{"$f":"SUM(T24+T91+T158)","v":49},11,0,0,3,2,3.0000000000000004,{"$f":"SUM(T292:Z292)","v":68},null,{"$f":"SUM(I292+R292+AA292)","v":169}]
["09:45:00",{"$f":"SUM(B25+B92+B159)","v":63},22,1,0,3,2,7,{"$f":"SUM(B293:H293)","v":98},null,{"$f":"SUM(K25+K92+K159)","v":4},0,0,0,1,0,4,{"$f":"SUM(K293:Q293)","v":9},null,{"$f":"SUM(T25+T92+T159)","v":54},8,1,0,3,3.0000000000000004,1,{"$f":"SUM(T293:Z293)","v":70},null,{"$f":"SUM(I293+R293+AA293)","v":177}]
["1 Hr",{"$f":"SUM(B290:B293)","v":246},75,8,0,14,9,23,375,null,{"$f":"SUM(K290:K293)","v":11},5,0,0,4,1,17,38,null,{"$f":"SUM(T290:T293)","v":228},43,4,0,11,12,14,312,null,{"$f":"SUM(AC290:AC293)","v":725}]
["10:00:00",{"$f":"SUM(B27+B94+B161)","v":64},21,0,0,3,2,3,{"$f":"SUM(B295:H295)","v":93},null,{"$f":"SUM(K27+K94+K161)","v":6},0,0,0,1,1,4,{"$f":"SUM(K295:Q295)","v":12},null,{"$f":"SUM(T27+T94+T161)","v":34},7,1,0,3,2,1,{"$f":"SUM(T295:Z295)","v":48},null,{"$f":"SUM(I295+R295+AA295)","v":153}]
["10:15:00",{"$f":"SUM(B28+B95+B162)","v":50},9,3,0,4,3.0000000000000004,2,{"$f":"SUM(B296:H296)","v":71},null,{"$f":"SUM(K28+K95+K162)","v":1},1,0,0,0,1,5,{"$f":"SUM(K296:Q296)","v":8},null,{"$f":"SUM(T28+T95+T162)","v":48},8,1,0,1,2,2,{"$f":"SUM(T296:Z296)","v":62},null,{"$f":"SUM(I296+R296+AA296)","v":141}]
["10:30:00",{"$f":"SUM(B29+B96+B163)","v":49},17,1,0,4,1,5,{"$f":"SUM(B297:H297)","v":77},null,{"$f":"SUM(K29+K96+K163)","v":8},3,0,0,2,0,1,{"$f":"SUM(K297:Q297)","v":14},null,{"$f":"SUM(T29+T96+T163)","v":57},12,2,0,3,2,1,{"$f":"SUM(T297:Z297)","v":77},null,{"$f":"SUM(I297+R297+AA297)","v":168}]
["10:45:00",{"$f":"SUM(B30+B97+B164)","v":62},4,2,0,3,4,0,{"$f":"SUM(B298:H298)","v":75},null,{"$f":"SUM(K30+K97+K164)","v":2},2,0,0,0,0,4,{"$f":"SUM(K298:Q298)","v":8},null,{"$f":"SUM(T30+T97+T164)","v":60},17,1,0,2,2,3,{"$f":"SUM(T298:Z298)","v":85},null,{"$f":"SUM(I298+R298+AA298)","v":168}]
["1 Hr",{"$f":"SUM(B295:B298)","v":225},51,6,0,14,10,10,316,null,{"$f":"SUM(K295:K298)","v":17},6,0,0,3,2,14,42,null,{"$f":"SUM(T295:T298)","v":199},44,5,0,9,8,7,272,null,{"$f":"SUM(AC295:AC298)","v":630}]
["11:00:00",{"$f":"SUM(B32+B99+B166)","v":63},13,0,0,4,4,2,{"$f":"SUM(B300:H300)","v":86},null,{"$f":"SUM(K32+K99+K166)","v":2},2,0,0,1,0,3,{"$f":"SUM(K300:Q300)","v":8},null,{"$f":"SUM(T32+T99+T166)","v":45},17,0,0,3,7,1,{"$f":"SUM(T300:Z300)","v":73},null,{"$f":"SUM(I300+R300+AA300)","v":167}]
["11:15:00",{"$f":"SUM(B33+B100+B167)","v":50},14,0,0,3,7,6.0000000000000009,{"$f":"SUM(B301:H301)","v":80},null,{"$f":"SUM(K33+K100+K167)","v":5},1,0,0,1,0,3.0000000000000004,{"$f":"SUM(K301:Q301)","v":10},null,{"$f":"SUM(T33+T100+T167)","v":39},11,0,0,2,3,2,{"$f":"SUM(T301:Z301)","v":57},null,{"$f":"SUM(I301+R301+AA301)","v":147}]
["11:30:00",{"$f":"SUM(B34+B101+B168)","v":52},21,0,0,2,5,3.0000000000000004,{"$f":"SUM(B302:H302)","v":83},null,{"$f":"SUM(K34+K101+K168)","v":5},3,0,0,1,0,3,{"$f":"SUM(K302:Q302)","v":12},null,{"$f":"SUM(T34+T101+T168)","v":46},12,1,0,3,5,3,{"$f":"SUM(T302:Z302)","v":70},null,{"$f":"SUM(I302+R302+AA302)","v":165}]
["11:45:00",{"$f":"SUM(B35+B102+B169)","v":53},11,3,0,3,4,2,{"$f":"SUM(B303:H303)","v":76},null,{"$f":"SUM(K35+K102+K169)","v":6},0,0,0,1,3.0000000000000004,2,{"$f":"SUM(K303:Q303)","v":12},null,{"$f":"SUM(T35+T102+T169)","v":64},15,1,0,3,7.0000000000000009,5,{"$f":"SUM(T303:Z303)","v":95},null,{"$f":"SUM(I303+R303+AA303)","v":183}]
["1 Hr",{"$f":"SUM(B300:B303)","v":218},59,3,0,12,20,13,325,null,{"$f":"SUM(K300:K303)","v":18},6,0,0,4,3.0000000000000004,11,42,null,{"$f":"SUM(T300:T303)","v":194},55,2,0,11,22,11,295,null,{"$f":"SUM(AC300:AC303)","v":662}]
["12:00:00",{"$f":"SUM(B37+B104+B171)","v":51},17,2,0,4,3,2,{"$f":"SUM(B305:H305)","v":79},null,{"$f":"SUM(K37+K104+K171)","v":1},1,0,0,0,0,3,{"$f":"SUM(K305:Q305)","v":5},null,{"$f":"SUM(T37+T104+T171)","v":55},11,2,0,1,1,3.0000000000000004,{"$f":"SUM(T305:Z305)","v":73},null,{"$f":"SUM(I305+R305+AA305)","v":157}]
["12:15:00",{"$f":"SUM(B38+B105+B172)","v":55},11,1,0,3,3,3.0000000000000004,{"$f":"SUM(B306:H306)","v":76},null,{"$f":"SUM(K38+K105+K172)","v":4},0,0,0,2,1,3.0000000000000004,{"$f":"SUM(K306:Q306)","v":10},null,{"$f":"SUM(T38+T105+T172)","v":54},15,0,0,2,5,1,{"$f":"SUM(T306:Z306)","v":77},null,{"$f":"SUM(I306+R306+AA306)","v":163}]
["12:30:00",{"$f":"SUM(B39+B106+B173)","v":55},8,2,0,3,5,2,{"$f":"SUM(B307:H307)","v":75},null,{"$f":"SUM(K39+K106+K173)","v":2},1,0,0,0,1,2,{"$f":"SUM(K307:Q307)","v":6},null,{"$f":"SUM(T39+T106+T173)","v":57},13,3,0,3,5,1,{"$f":"SUM(T307:Z307)","v":82},null,{"$f":"SUM(I307+R307+AA307)","v":163}]
["12:45:00",{"$f":"SUM(B40+B107+B174)","v":56},11,0,0,4,5,3,{"$f":"SUM(B308:H308)","v":79},null,{"$f":"SUM(K40+K107+K174)","v":7},3,0,0,1,1,2,{"$f":"SUM(K308:Q308)","v":14},null,{"$f":"SUM(T40+T107+T174)","v":62},13,1,0,4,0,7,{"$f":"SUM(T308:Z308)","v":87},null,{"$f":"SUM(I308+R308+AA308)","v":180}]
["1 Hr",{"$f":"SUM(B305:B308)","v":217},47,5,0,14,16,10,309,null,{"$f":"SUM(K305:K308)","v":14},5,0,0,3,3,10,35,null,{"$f":"SUM(T305:T308)","v":228},52,6,0,10,11,12,319,null,{"$f":"SUM(AC305:AC308)","v":663}]
["13:00:00",{"$f":"SUM(B42+B109+B176)","v":62},12,1,0,4,2,3.0000000000000004,{"$f":"SUM(B310:H310)","v":84},null,{"$f":"SUM(K42+K109+K176)","v":7},1,0,0,1,1,5,{"$f":"SUM(K310:Q310)","v":15},null,{"$f":"SUM(T42+T109+T176)","v":63},9,2,0,3,7,2,{"$f":"SUM(T310:Z310)","v":86},null,{"$f":"SUM(I310+R310+AA310)","v":185}]
["13:15:00",{"$f":"SUM(B43+B110+B177)","v":46},10,1,0,3,11,3,{"$f":"SUM(B311:H311)","v":74},null,{"$f":"SUM(K43+K110+K177)","v":5},0,0,0,1,1,2,{"$f":"SUM(K311:Q311)","v":9},null,{"$f":"SUM(T43+T110+T177)","v":62},16,2,0,3,6.0000000000000009,4,{"$f":"SUM(T311:Z311)","v":93},null,{"$f":"SUM(I311+R311+AA311)","v":176}]
["13:30:00",{"$f":"SUM(B44+B111+B178)","v":42},5,1,0,4,4,1,{"$f":"SUM(B312:H312)","v":57},null,{"$f":"SUM(K44+K111+K178)","v":4},0,0,0,1,0,2,{"$f":"SUM(K312:Q312)","v":7},null,{"$f":"SUM(T44+T111+T178)","v":64},10,3,0,2,5,5,{"$f":"SUM(T312:Z312)","v":89},null,{"$f":"SUM(I312+R312+AA312)","v":153}]
["13:45:00",{"$f":"SUM(B45+B112+B179)","v":43},11,0,0,3,4,5,{"$f":"SUM(B313:H313)","v":66},null,{"$f":"SUM(K45+K112+K179)","v":5},2,0,0,1,1,6,{"$f":"SUM(K313:Q313)","v":15},null,{"$f":"SUM(T45+T112+T179)","v":51},13,2,1,2,5,3,{"$f":"SUM(T313:Z313)","v":77},null,{"$f":"SUM(I313+R313+AA313)","v":158}]
["1 Hr",{"$f":"SUM(B310:B313)","v":193},38,3,0,14,21,12,281,null,{"$f":"SUM(K310:K313)","v":21},3,0,0,4,3,15,46,null,{"$f":"SUM(T310:T313)","v":240},48,9,1,10,23,14,345,null,{"$f":"SUM(AC310:AC313)","v":672}]
["14:00:00",{"$f":"SUM(B47+B114+B181)","v":43},6,2,0,4,4,1,{"$f":"SUM(B315:H315)","v":60},null,{"$f":"SUM(K47+K114+K181)","v":0},1,0,0,1,0,5,{"$f":"SUM(K315:Q315)","v":7},null,{"$f":"SUM(T47+T114+T181)","v":53},13,0,0,4,10,2,{"$f":"SUM(T315:Z315)","v":82},null,{"$f":"SUM(I315+R315+AA315)","v":149}]
["14:15:00",{"$f":"SUM(B48+B115+B182)","v":62},8,1,0,3,4,3,{"$f":"SUM(B316:H316)","v":81},null,{"$f":"SUM(K48+K115+K182)","v":3},1,0,0,0,4,2,{"$f":"SUM(K316:Q316)","v":10},null,{"$f":"SUM(T48+T115+T182)","v":87},8,1,0,5,6,4,{"$f":"SUM(T316:Z316)","v":111},null,{"$f":"SUM(I316+R316+AA316)","v":202}]
["14:30:00",{"$f":"SUM(B49+B116+B183)","v":47},4,1,0,5,10,4,{"$f":"SUM(B317:H317)","v":71},null,{"$f":"SUM(K49+K116+K183)","v":7},2,0,0,1,1,5,{"$f":"SUM(K317:Q317)","v":16},null,{"$f":"SUM(T49+T116+T183)","v":50},13,0,0,1,8,5,{"$f":"SUM(T317:Z317)","v":77},null,{"$f":"SUM(I317+R317+AA317)","v":164}]
["14:45:00",{"$f":"SUM(B50+B117+B184)","v":55},8,2,0,4,2,10,{"$f":"SUM(B318:H318)","v":81},null,{"$f":"SUM(K50+K117+K184)","v":1},1,0,0,1,2,4,{"$f":"SUM(K318:Q318)","v":9},null,{"$f":"SUM(T50+T117+T184)","v":62},9,1,1,3,7.0000000000000009,4,{"$f":"SUM(T318:Z318)","v":87},null,{"$f":"SUM(I318+R318+AA318)","v":177}]
["1 Hr",{"$f":"SUM(B315:B318)","v":207},26,6,0,16,20,18,293,null,{"$f":"SUM(K315:K318)","v":11},5,0,0,3,7,16,42,null,{"$f":"SUM(T315:T318)","v":252},43,2,1,13,31,15,357,null,{"$f":"SUM(AC315:AC318)","v":692}]
["15:00:00",{"$f":"SUM(B52+B119+B186)","v":68},5,0,0,3,8,1,{"$f":"SUM(B320:H320)","v":85},null,{"$f":"SUM(K52+K119+K186)","v":5},0,0,0,1,1,5,{"$f":"SUM(K320:Q320)","v":12},null,{"$f":"SUM(T52+T119+T186)","v":71},19,3,0,3,7,3,{"$f":"SUM(T320:Z320)","v":106},null,{"$f":"SUM(I320+R320+AA320)","v":203}]
["15:15:00",{"$f":"SUM(B53+B120+B187)","v":51},7,1,0,4,6,2,{"$f":"SUM(B321:H321)","v":71},null,{"$f":"SUM(K53+K120+K187)","v":7},2,1,0,1,0,4,{"$f":"SUM(K321:Q321)","v":15},null,{"$f":"SUM(T53+T120+T187)","v":81},16,2,0,2,4,5,{"$f":"SUM(T321:Z321)","v":110},null,{"$f":"SUM(I321+R321+AA321)","v":196}]
["15:30:00",{"$f":"SUM(B54+B121+B188)","v":51},6,0,0,4,3.0000000000000004,4,{"$f":"SUM(B322:H322)","v":68},null,{"$f":"SUM(K54+K121+K188)","v":6},1,0,0,1,1,6.0000000000000009,{"$f":"SUM(K322:Q322)","v":15},null,{"$f":"SUM(T54+T121+T188)","v":56},12,2,0,2,4,5,{"$f":"SUM(T322:Z322)","v":81},null,{"$f":"SUM(I322+R322+AA322)","v":164}]
["15:45:00",{"$f":"SUM(B55+B122+B189)","v":48},5,0,0,3,1,3.0000000000000004,{"$f":"SUM(B323:H323)","v":60},null,{"$f":"SUM(K55+K122+K189)","v":5},0,0,0,0,2,2,{"$f":"SUM(K323:Q323)","v":9},null,{"$f":"SUM(T55+T122+T189)","v":79},15,1,0,2,7.0000000000000009,6,{"$f":"SUM(T323:Z323)","v":110},null,{"$f":"SUM(I323+R323+AA323)","v":179}]
["1 Hr",{"$f":"SUM(B320:B323)","v":218},23,1,0,14,18,10,284,null,{"$f":"SUM(K320:K323)","v":23},3,1,0,3,4,17,51,null,{"$f":"SUM(T320:T323)","v":287},62,8,0,9,22,19,407,null,{"$f":"SUM(AC320:AC323)","v":742}]
["16:00:00",{"$f":"SUM(B57+B124+B191)","v":48},8,2,0,3,4,6,{"$f":"SUM(B325:H325)","v":71},null,{"$f":"SUM(K57+K124+K191)","v":10},1,0,0,0,1,6,{"$f":"SUM(K325:Q325)","v":18},null,{"$f":"SUM(T57+T124+T191)","v":76},17,0,0,3,2,3.0000000000000004,{"$f":"SUM(T325:Z325)","v":101},null,{"$f":"SUM(I325+R325+AA325)","v":190}]
["16:15:00",{"$f":"SUM(B58+B125+B192)","v":49},7,0,0,4,2,5,{"$f":"SUM(B326:H326)","v":67},null,{"$f":"SUM(K58+K125+K192)","v":6},1,1,0,3,1,8,{"$f":"SUM(K326:Q326)","v":20},null,{"$f":"SUM(T58+T125+T192)","v":69},13,5,0,3,3,8,{"$f":"SUM(T326:Z326)","v":101},null,{"$f":"SUM(I326+R326+AA326)","v":188}]
["16:30:00",{"$f":"SUM(B59+B126+B193)","v":56},5,0,0,3,3,6,{"$f":"SUM(B327:H327)","v":73},null,{"$f":"SUM(K59+K126+K193)","v":4},0,0,0,1,3.0000000000000004,5,{"$f":"SUM(K327:Q327)","v":13},null,{"$f":"SUM(T59+T126+T193)","v":57},15,0,0,2,4,13,{"$f":"SUM(T327:Z327)","v":91},null,{"$f":"SUM(I327+R327+AA327)","v":177}]
["16:45:00",{"$f":"SUM(B60+B127+B194)","v":47},4,1,0,4,4,5,{"$f":"SUM(B328:H328)","v":65},null,{"$f":"SUM(K60+K127+K194)","v":11},0,0,0,1,3,6,{"$f":"SUM(K328:Q328)","v":21},null,{"$f":"SUM(T60+T127+T194)","v":68},14,1,0,1,8,11,{"$f":"SUM(T328:Z328)","v":103},null,{"$f":"SUM(I328+R328+AA328)","v":189}]
["1 Hr",{"$f":"SUM(B325:B328)","v":200},24,3,0,14,13,22,276,null,{"$f":"SUM(K325:K328)","v":31},2,1,0,5,8,25,72,null,{"$f":"SUM(T325:T328)","v":270},59,6,0,9,17,35,396,null,{"$f":"SUM(AC325:AC328)","v":744}]
["17:00:00",{"$f":"SUM(B62+B129+B196)","v":63},6,0,0,3,1,12,{"$f":"SUM(B330:H330)","v":85},null,{"$f":"SUM(K62+K129+K196)","v":13},0,0,0,1,2,6,{"$f":"SUM(K330:Q330)","v":22},null,{"$f":"SUM(T62+T129+T196)","v":76},16,0,0,4,4,8,{"$f":"SUM(T330:Z330)","v":108},null,{"$f":"SUM(I330+R330+AA330)","v":215}]
["17:15:00",{"$f":"SUM(B63+B130+B197)","v":62},6,1,0,4,6.0000000000000009,1,{"$f":"SUM(B331:H331)","v":80},null,{"$f":"SUM(K63+K130+K197)","v":7},0,0,0,0,1,4,{"$f":"SUM(K331:Q331)","v":12},null,{"$f":"SUM(T63+T130+T197)","v":63},9,1,0,3,9,8,{"$f":"SUM(T331:Z331)","v":93},null,{"$f":"SUM(I331+R331+AA331)","v":185}]
["17:30:00",{"$f":"SUM(B64+B131+B198)","v":51},3,0,0,2,5,14,{"$f":"SUM(B332:H332)","v":75},null,{"$f":"SUM(K64+K131+K198)","v":3},1,0,0,1,1,2,{"$f":"SUM(K332:Q332)","v":8},null,{"$f":"SUM(T64+T131+T198)","v":84},8,1,0,2,9,6,{"$f":"SUM(T332:Z332)","v":110},null,{"$f":"SUM(I332+R332+AA332)","v":193}]
["17:45:00",{"$f":"SUM(B65+B132+B199)","v":61},3,0,0,5,2,7,{"$f":"SUM(B333:H333)","v":78},null,{"$f":"SUM(K65+K132+K199)","v":8},1,0,0,1,1,7,{"$f":"SUM(K333:Q333)","v":18},null,{"$f":"SUM(T65+T132+T199)","v":83},5,1,0,3,5,13,{"$f":"SUM(T333:Z333)","v":110},null,{"$f":"SUM(I333+R333+AA333)","v":206}]
["1 Hr",{"$f":"SUM(B330:B333)","v":237},18,1,0,14,14,34,318,null,{"$f":"SUM(K330:K333)","v":31},2,0,0,3,5,19,60,null,{"$f":"SUM(T330:T333)","v":306},38,3,0,12,27,35,421,null,{"$f":"SUM(AC330:AC333)","v":799}]
["18:00:00",{"$f":"SUM(B67+B134+B201)","v":44},1,0,0,2,3.0000000000000004,7,{"$f":"SUM(B335:H335)","v":57},null,{"$f":"SUM(K67+K134+K201)","v":8},1,0,0,1,3,3,{"$f":"SUM(K335:Q335)","v":16},null,{"$f":"SUM(T67+T134+T201)","v":79},6,1,0,2,6,6,{"$f":"SUM(T335:Z335)","v":100},null,{"$f":"SUM(I335+R335+AA335)","v":173}]
["18:15:00",{"$f":"SUM(B68+B135+B202)","v":62},1,0,0,3,5,4,{"$f":"SUM(B336:H336)","v":75},null,{"$f":"SUM(K68+K135+K202)","v":4},0,0,0,1,0,4,{"$f":"SUM(K336:Q336)","v":9},null,{"$f":"SUM(T68+T135+T202)","v":72},7,0,0,2,5,5,{"$f":"SUM(T336:Z336)","v":91},null,{"$f":"SUM(I336+R336+AA336)","v":175}]
["18:30:00",{"$f":"SUM(B69+B136+B203)","v":54},3,0,0,3,11,2,{"$f":"SUM(B337:H337)","v":73},null,{"$f":"SUM(K69+K136+K203)","v":7},0,0,0,1,2,7,{"$f":"SUM(K337:Q337)","v":17},null,{"$f":"SUM(T69+T136+T203)","v":73},8,1,0,2,5,13,{"$f":"SUM(T337:Z337)","v":102},null,{"$f":"SUM(I337+R337+AA337)","v":192}]
["18:45:00",{"$f":"SUM(B70+B137+B204)","v":49},5,0,0,4,13.000000000000002,2,{"$f":"SUM(B338:H338)","v":73},null,{"$f":"SUM(K70+K137+K204)","v":11},1,0,0,1,3,3.0000000000000004,{"$f":"SUM(K338:Q338)","v":19},null,{"$f":"SUM(T70+T137+T204)","v":70},3,0,0,1,14.000000000000002,8,{"$f":"SUM(T338:Z338)","v":96},null,{"$f":"SUM(I338+R338+AA338)","v":188}]
["1 Hr",{"$f":"SUM(B335:B338)","v":209},10,0,0,12,32,15,278,null,{"$f":"SUM(K335:K338)","v":30},2,0,0,4,8,17,61,null,{"$f":"SUM(T335:T338)","v":294},24,2,0,7,30,32,389,null,{"$f":"SUM(AC335:AC338)","v":728}]
[]
["Total",{"$f":"SUM(B339+B334+B329+B324+B319+B314+B309+B304+B299+B294+B289+B284)","v":2666},514,53,0,169,202,221,3825,null,{"$f":"SUM(K339+K334+K329+K324+K319+K314+K309+K304+K299+K294+K289+K284)","v":240},44,2,0,45,45,207,583,null,{"$f":"SUM(T339+T334+T329+T324+T319+T314+T309+T304+T299+T294+T289+T284)","v":2844},533,51,2,127,214,228,3999,null,{"$f":"SUM(AC339+AC334+AC329+AC324+AC319+AC314+AC309+AC304+AC299+AC294+AC289+AC284)","v":8407}]